fink buildlock error Menlo Washington

Laptop & Desktop Maintenance & Repair Data Backup & Recovery System Tuning & Optimization Laptop Screen Replacement Fix Faulty WiFi DC Jack, USB Port & Headphone Jack Repair Virus & Spyware Removal Software Installation Internal Cleaning Repair Laptop Hinges & Cabinet Remove Unnecessary OEM Apps Replace Batteries Install Apple™, Windows™, and Linux™ operating systems.

Address 2417 275th Pl, Ocean Park, WA 98640
Phone (503) 468-8317
Website Link http://www.chriscustomcomputer.com
Hours

fink buildlock error Menlo, Washington

A: Read the docs next time. A: If you're seeing this:Unknown option: 1 Usage: head [-options] ...followed by a list of option descriptions, you have a broken head executable. Download your free book today! Stop. ### execution of LD_TWOLEVEL_NAMESPACE=1 failed, exit code 2 Failed: compiling gtk+2-2.2.4-2 failedthe problem is due to confusion between headers from the freetype | freetype-hinting package and the freetype2 headers that

And if you are having problems with a build that aren't covered by another FAQ entry, you should also check whether you have libraries in /usr/local/lib or headers in /usr/local/include.If you In such an event the buildlockpackage isn't toggled to "not-installed" in dpkg's status file, whereasfink doesn't think it exists. I installed the recent versions of X11 and XCode tools w/OS X 10.4.5 The fink files were transferred from an old G4 PowerBook running 10.3.9. Reading build conflict for fink-0.36.1-51...

I installed the recent versions of X11 and XCode >> tools w/OS >> X 10.4.5 The fink files were transferred from an old G4 PowerBook >> running >> 10.3.9. g. Packages that had been completely built before this error occurred will not have to be recompiled. com> Date: 2014-04-18 4:56:06 Message-ID: 5350B066.2040607 () gmail !

Q6.17: Fink says Failed: Can't resolve dependency "system-java-dev", but there's no such package. A: If you have an error that looks like thisunix_dl.c: In function `rep_open_dl_library': unix_dl.c:328: warning: assignment discards qualifiers from pointer target type unix_dl.c: In function `rep_find_c_symbol': unix_dl.c:466: error: `Dl_info' undeclared (first When it does, there is nothing that the fink executable can do to fix the error, proceed directly to the last bulleted item. Q6.11: I get messages saying that I'm missing stddef.h | wchar.h | stdlib.h | crt1.o, or that my C compiler cannot create executables.

To track down the offending file(s), search in the output of the build for the nonexistent file, e.g. Fink › fink-beginners Search everywhere only in this topic Advanced Search Buildlock Failure ‹ Previous Topic Next Topic › Classic List Threaded ♦ ♦ Locked 4 messages Daniel Rampelt Reply A: This happens because one of the steps in the build of atlas sends a prompt to the user that Fink Commander doesn't display. Rescue delivers http://p.sf.net/sfu/logmein_12329d2d _______________________________________________ Fink-users mailing list [email protected] List archive: http://news.gmane.org/gmane.os.macosx.fink.user Subscription management: https://lists.sourceforge.net/lists/listinfo/fink-users

vvv Home | News | Sitemap | FAQ | advertise | OSDir is an Inevitable website.

Note: Fink is deliberately set up such that all official binaries are identical regardless of what machine they are built on, so things like G5 optimization won't happen with an official This situation can also occur if something interferes with the lock removal process itself, for example the computer being turned off, or a user pressing control-C or other interrupt. Free Trial Remotely access PCs and mobile devices and provide instant support Improve your efficiency, and focus on delivering more value-add services Discover what IT Professionals Know. If not, then run the Dev Tools Installer again, and install the DevSDK package using a Custom Install.The cannot create executables error can also occur when your Developer Tools version is

This error occurs if a build ends ungracefully, e.g. Failed: buildlock failure G4cube:/sw/src root# less -N /sw/var/lib/dpkg/status

äƤʤäƤޤ顼åΤȤ
#fink build postgresql80-unified
Ƥᡦȡȥ顼åɤȡ
 dpkg: parse error, in file dpkg: parse error, in file `/sw/var/lib/dpkg/status' near line 1497 package `fink-buildlock-postgresql80-unified-8.0.3-14': Q6.13: I can't install anything because I get "dpkg: parse error, in file `/sw/var/lib/dpkg/status'"! The following package will be installed or updated: fink Setting runtime build-lock... 

I installed the recent versions of X11 and XCode >> tools w/OS >> X 10.4.5 The fink files were transferred from an old G4 PowerBook >> running >> 10.3.9. Q6.2: When I try a "fink selfupdate-cvs" I get this message: "cvs: Command not found." A: You need to install the Developer Tools. Many other things don't work, but I'll start with this since it = may > be the root problem? > > Should I just delete my /sw folder and start over? Please don't fill out this field.

A: Often, in a complicated build tree, you may find that some of the packages depend on a particular version of a library, and other depend on a different one (e.g. Q6.3: I'm getting an error message involving make A: if your message is of the formmake: command not foundorCan't exec "make": No such file or directory at /sw/lib/perl5/Fink/Services.pm line 190.It means A: For errors that look like the following:running build running build_ext Traceback (most recent call last): File "setup_socket_ssl.py", line 21, in ? If that doesn't workfink list -t fink-buildlock will list it, then you can use fink remove package-name to remove it as with any other package.Installing the buildlock package when fink is

It >>>> looks like something in fink-mirrors is wedged. Q6.26: When I try to update an app package on Yosemite, I see errors involving a PkgInfo file A: The error in question looks likeUnpacking replacement wxmaxima-mac ... /sw/bin/dpkg: error processing The Mono Framework has been known to install a /usr/bin/freetype-config that is a symbolic link to a file in that framework.If your error looks like:/sw/include/pango-1.0/pango/pangoft2.h:52: error: parse error before '*' token if your powergoes out (though a sleep where your machine gets woken back up ratherthan rebooted shouldn't do this).

Regardless of the cause of the lock failure, don't worry: you have not wasted compiling time! Youdin Princeton University Department of Astrophysical Sciences Peyton Hall Princeton, NJ 08544 [email protected] It contains a buggy reimplementation of a few important system calls that will cause a number of strange and transient errors such as this.Otherwise, an mv error typically means that another Is this true?

Try building just this current package fink (i.e, "fink build fink"). Many other things don't work, but I'll start with this since >> it may >> be the root problem? >> >> Should I just delete my /sw folder and start over? All Rights Reserved. db44).

Try building just this current package fink (i.e, "fink build fink"). dpkg-deb -b /sw/src/fink.build/root-fink-buildlock-fink-0.36.1-51 /sw/src/fink.build dpkg-deb: building package `fink-buildlock-fink-0.36.1-51' in `/sw/src/fink.build/fink-buildlock-fink-0.36.1-51_2013.11.30-13.01.36_darwin-i386.deb'. When that has completed successfully, you could retry whatever you did that led to the present error. Please change to a user with a writeable home directory, or use 'sudo xcodebuild -license' to accept the license at the system level (for all users).### execution of /tmp/fink.xmeJ3 failed, exit

The crash will tell you which package fink was trying to build at that moment: try to have fink build just that package, which will usually succeed, then you can retry If you're on Jaguar, and are using the default system Perl version, you'll have the pm560 variant, and if you've installed Perl 5.8.0 you may have the pm580 variant. Q6.15: I get build errors involving `Dl_info'. Packages that had been completely built before this error > occurred will not have to be recompiled. > > See http://wiki.finkproject.org/index.php/Fink:buildlocks for more information. > > /sw/bin/dpkg-lockwait -r fink-buildlock-fink-0.36.1-51 >/dev/null >

Sign up for the SourceForge newsletter: I agree to receive quotes, newsletters and other information from sourceforge.net and its partners regarding IT services and products. self-update works, incidentally The error: > The following 24 packages will be installed or updated: > autoconf2.5 automake1.8 docbook-xsl freetype2-shlibs glib2 glib2-dev > glib2-shlibs gmp gmp-shlibs gtk-doc lcms lcms-shlibs libmad-shlibs >