fatal error u1077 return code 0x2 Kenmore Washington

We are specialized in computer repair and IT support solutions for all home and Business user.Here, we tend to make the most complex problem of your IT devices fixed easily , while we understand your need.

Address 4500 9th Ave NE #300, Seattle, WA 98105
Phone (305) 909-2148
Website Link http://www.virtualtouchpro.com
Hours

fatal error u1077 return code 0x2 Kenmore, Washington

Join them; it only takes a minute: Sign up Building Qt - NMAKE : fatal error U1077: 'cd' : return code '0x2' up vote 3 down vote favorite 2 I'm trying That is, for generating code for RMON-MIB, you have to load RMON-MIB, TOKEN-RING-RMON-MIB, and RFC1213-MIB. Navigation Qt Forum Login Search Search Categories Recent Tags Popular Groups Search Your browser does not seem to support JavaScript. All Rights Reserved.

I created a new environment variable QMAKESPEC and set the value to win-32-msvc2008. Reply Quote 0 leon.anavi last edited by [quote author="muntoo" date="1303361072"] @cd /D C:\Qt configure -release -no-webkit -no-phonon -no-phonon-backend -no-script -no-scripttools -no-qt3support [email protected] [/quote] You might need to specify the platform when Completing the CAPTCHA proves you are a human and gives you temporary access to the web property. c:\qcad\src\3rdparty\qt-labs-qtscriptgenerator-4.8.5\generated_cpp\com_trolltech_qt_webkit\qtscriptshell_qwebpluginfactory.cpp(58) : warning C4715: 'QtScriptShell_QWebPluginFactory::create' : not all control paths return a value c:\qcad\src\3rdparty\qt-labs-qtscriptgenerator-4.8.5\generated_cpp\com_trolltech_qt_webkit\qtscriptshell_qwebpluginfactory.cpp(128) : warning C4715: 'QtScriptShell_QWebPluginFactory::plugins' : not all control paths return a value c:\qcad\src\3rdparty\qt-labs-qtscriptgenerator-4.8.5\generated_cpp\com_trolltech_qt_webkit\qtscriptshell_qwebhistoryinterface.cpp(105) : warning C4715: 'QtScriptShell_QWebHistoryInterface::historyContains'

Error Messages During Compilation Error Message Exception: java.io.IOException: CreateProcess: nmake error=2 Compilation Failed. (or) Microsoft (R) 32-bit C/C++ Optimizing Compiler Version 12.00.8168 for 80x86 Copyright (C) Microsoft Corp 1984-1998. Ask a question Quick access Forums home Browse forums users FAQ Search related threads Remove From My Forums Answered by: NMAKE : fatal error U1077: 'cl' : return code '0x2' Archived If you are at an office or shared network, you can ask the network administrator to run a scan across the network looking for misconfigured or infected devices. Going to be away for 4 months, should we turn off the refrigerator or leave it on with water inside?

I used the MSVS Command Prompt (2010), and typed in: @cd /D C:\Qt configure -release -no-webkit -no-phonon -no-phonon-backend -no-script -no-scripttools -no-qt3support [email protected] That worked OK, so then I did this: @[email protected] As a result, your viewing experience will be diminished, and you have been placed in read-only mode. Reply Quote 0 jpo38 last edited by I had the same problem yesterday when trying to build Qt 4.7.4 with VS2008, and I remember having this problem in the past with No, it means cl.exe was executed and it encountered an error.

Forum List Topic List New Topic Search Register User List Log In Powered by RForum and Captchator. Generating Visual Studio project files... Reason The Makefile(s) of agent has the compilation flag as one of the parameter as "-c" using which first the *.c and *.h are compiled as object files (*.o) and then All Rights Reserved.

My system is Win7 64 bit. NMAKE : fatal error U1077: 'cd' : return code '0x2' Stop. execute: Unknown error (-nodepend) (-tp) (vc) (-r) (C:/Qt/4.7.2-vc/projects.pro) (-o) (C:/Qt/4.7.2-vc) Qmake failed, return code -1 [/quote] It seems that you use wrong target architecture. Back to the top Ruby-Forum.com Ruby Ruby Ruby on Rails JRuby Ruby Jobs About this forum Ruby-Forum Non-English Italian Ruby Group Forum: Ruby VS12 NMAKE : fatal error U1077: 'cl' : return

They are in the same directory. If you are using MS VC++, you can do this by running "vcvars32.bat" present in the "Bin" directory of your VC++ installation. NoScript). By joining our free community you will have access to post topics, communicate privately with other members (PM), respond to polls, upload content and access many other special features.

However, about 30 min into the compilation I've run into the following error: NMAKE : fatal error U1077: 'cd' :return code '0x2'. share|improve this answer answered Apr 23 at 17:41 sith 398 add a comment| Your Answer draft saved draft discarded Sign up or log in Sign up using Google Sign up All rights reserved. Creating makefiles in src...

I completed the configuration of QCAD without any problems. Type 'y' to accept this license offer. I think Qt uses perl for scripting. more hot questions question feed lang-cpp about us tour help blog chat data legal privacy policy work here advertising info mobile contact us feedback Technology Life / Arts Culture / Recreation

Exploded Suffixes Generate a 6 character string from a 15 character alphabet How should I interpret "English is poor" review when I used a language check service before submission? Jean Reply Quote 0 dezdechado last edited by [quote author="muntoo" date="1305411723"] Creating makefiles in src... Below are the sites that helped me figure everything out. The time now is 16:30.

NMAKE : fatal error U1077: '"C:\Program Files\Microsoft Visual Studio 9.0\VC\bin\nmake.exe"' : return code '0x2' Stop. Building the file took a long time. NMAKE : fatal error U1077: 'cd' : return code '0x2' Stop. Over 90 percent of questions asked here gets answered.

Reply Quote 0 THSQT last edited by I always have the same error: c:\qt\4.7.2\include\qtcore../../src/corelib/global/qt_windows.h(63) : fatal err or C1083: Cannot open include file: 'windows.h': No such file or directory NMAKE : One more step Please complete the security check to access ask.wireshark.org Why do I have to complete a CAPTCHA? When I tried to compile Qt using nmake I always got an error stating that some dll was in use. http://www.holoborodko.com/pavel/2011/02/01/how-to-compile-qt-4-7-with-visual-studio-2010/ http://stackoverflow.com/questions/4379374/compiling-qt-visual-studio-2010 http://blog.paulnettleship.com/2010/11/11/troubleshooting-visual-studio-2010-and-qt-4-7-integration/ http://dcsoft.wordpress.com/ FYI: I’m on windows 7, using visual studio 2010 ultimate (version 10.0.30319.1), running on a Intel i7(q720).

Then generate code and compile. All rights reserved. p.s I dont have enough points to add-a-comment. Why is absolute zero unattainable?

You may have to register before you can post: click the register link above to proceed. A Shadowy Encounter "Rollbacked" or "rolled back" the edit?