fatal error error writing to broken pipe compilation terminated Jeffersonton Virginia

Address 122 Blue Ridge St, Warrenton, VA 20186
Phone (540) 878-0277
Website Link
Hours

fatal error error writing to broken pipe compilation terminated Jeffersonton, Virginia

This is a terrible workaround, but should work for now until setuptools can better detect that 10.6 with XCode 4 no longer has PPC as an applicable target architecture. Mitchell [:dustin] 2011-03-22 15:32:43 PDT Looks like a compile error and/or a bug in gcc/binutils to me.. Python tries to build C extensions with PPC, fails. All rights reserved.

Is there any job that can't be automated? Can two integer polynomials touch in an irrational point? In it, you'll get: The week's top questions and answers Important community announcements Questions that need answers see an example newsletter By subscribing, you agree to the privacy policy and terms Reload to refresh your session.

Is the mass of an individual star almost constant throughout its life? Are there any rules or guidelines about designing a flag? Pronuncia strana della "s" dopo una "r": un fenomeno romano o di tutta l'Italia? The issues to consider are briefly outline on https://www-acc.gsi.de/wiki/FESA/FESA3DatabaseWorkflow201 .

share|improve this answer edited Feb 20 '12 at 0:13 Simon Sheehan 6,869113862 answered Apr 12 '11 at 15:29 Marcelo Guinea 111 add a comment| Your Answer draft saved draft discarded Log level INFO allows to see detailed output of various FESA actions, e.g. Created using Sphinx 1.3.5. share|improve this answer edited May 10 '11 at 2:05 answered May 10 '11 at 1:54 Ned Deily 52.9k1097118 thanks your answer helped me. –Andre Bossard May 13 '11 at

ffmpeg 0.7.7 installs fine. How to add an sObject to a sublislist? That depends. A: The rda data container expects all desired data values to be used during call of the settings property.

Fixes #35 a00c615 ejhumphrey referenced this issue in scikit-learn/scikit-learn Dec 26, 2012 Closed Compile issues with missing PPC assembler #262 Sign up for free to join this conversation on Error Messages Q: What does "ERROR Exception: FESA_9006 Failed to restore the devices." mean? A: One way is to select the value-item's type in the class design (Design View). All proper files appear to be in the /Developer/usr/bin folder and it doesn't seem to have problems finding anything.

After that you will be able to commit the SVN ignore info of the folder. Is intelligence the "natural" product of evolution? Apple disclaims any and all liability for the acts, omissions and conduct of any third parties in connection with or related to your use of the site. Q: How do I set launch a FESA3 deploy-unit automatically on a (virtual) front-end?

Q: How do I reset Eclipse's Secure Storage master password? Q: How do I place 2D-Arrays in the RDA data container using C++? Q: How do I increase the message queue size on a (virtual) FEC / on an SCU? I get a very similar error when using easy_install.

Python tries to build C extensions with PPC, fails. All postings and use of the content on this site are subject to the Apple Support Communities Terms of Use. Install glue using this line: $ sudo env ARCHFLAGS='-arch i386 -arch x86_64' pip install glue Table Of Contents FAQ Errors compiling PIL in Snow Leopard Previous topic Settings Next topic Any better way to determine source of light by analyzing the electromagnectic spectrum of the light Transform an array to another array by shifting value to adjacent element Appease Your Google

What sense of "hack" is involved in five hacks for using coffee filters? objcopy (...) bin/manifest bin/manifest.i686.o generated/cpp/RDADataTypesTestDU/GeneratedCode/ServerEquipmentGen.cpp:28: fatal error: error writing to -: Broken pipe compilation terminated. Skip to content Ignore Learn more Please note that GitHub no longer supports old versions of Firefox. I'm running Mac OS X Snow Leopard 10.6.6, all updates installed; Python 2.6.1; GCC 4.2; XCode 4 (in case that updated GCC) The exact error is: $ sudo python setup.py build

Mitchell [:dustin] 2011-03-23 15:59:57 PDT It's successfully run three more builds since then, one of exactly the same flavor as the failure. Why is it a bad idea for management to have constant access to every employee's inbox? A: The default-interval is: 300sec. building 'Crypto.Hash.MD2' extension gcc-4.2 -fno-strict-aliasing -fno-common -dynamic -fwrapv -Wall -Wstrict-prototypes -DENABLE_DTRACE -arch i386 -arch ppc -arch x86_64 -pipe -std=c99 -O3 -fomit-frame-pointer -Isrc/ -I/System/Library/Frameworks/Python.framework/Versions/2.6/include/python2.6 -c src/MD2.c -o build/temp.macosx-10.6-universal-2.6/src/MD2.o /usr/libexec/gcc/powerpc-apple-darwin10/4.2.1/as: assembler (/usr/bin/../libexec/gcc/darwin/ppc/as or

Q: How do I use preprocessor directives to enable MOCK sections? A: The exception relates to the content of the rolling buffer that is used internally for acquisition fields. Comment 2 Dustin J. Q: The default of a new value-item is scalar.

I don't see any other such failures for that slave, so let's give it some time to finish another build or two. more hot questions question feed default about us tour help blog chat data legal privacy policy work here advertising info mobile contact us feedback Technology Life / Arts Culture / Recreation Note: See TracTickets for help on using tickets. What is a type system?

Here is the error that I am getting: bash-3.2$ bash-3.2$ sudo pip install pycrypto Password: Downloading/unpacking pycrypto Running setup.py egg_info for package pycrypto Installing collected packages: pycrypto Running setup.py install for Any better way to determine source of light by analyzing the electromagnectic spectrum of the light Security Patch SUPEE-8788 - Possible Problems? "Rollbacked" or "rolled back" the edit? I have confirmed that Apple's upcoming release of OS X (Lion) will not have Python built with PPC. jflo commented May 19, 2011 Ran into this same issue when building Not the answer you're looking for?

I added this code to my pycrypto-2.3 setup.py in line 122 and following. Change History Changed 5 years ago by [email protected]… Attachment main.log.bz2​ added comment:1 Changed 5 years ago by [email protected]… Summary changed from ffmpeg-devel: to ffmpeg-devel: fatal error: when writing output to : Q: My FESA project was inserted into the SVN repository automatically during creation. Navigation index next | previous | glue 0.11.1 documentation » © Copyright 2013, Jorge Bastida.

How do I help minimize interruptions during group meetings as a student? It is also possible to search the preferences with the keyword "console" to find this option. Press "Finish" Working with FESA3 in Eclipse Q: How can I find out more on working with the FESA3 Eclipse plug-in? Q: How do I prevent Eclipse Kepler crashing with an error message relating to a gtk.cairo library? (01/2015) A: Launch Eclipse Kepler like this on the command line: eclipse -Dorg.eclipse.swt.internal.gtk.cairoGraphics=false& .