fatal error asm/unistd_32.h no such file or directory Honaker Virginia

Address 3616 Clarks Valley Rd, Swords Creek, VA 24649
Phone (276) 596-4348
Website Link
Hours

fatal error asm/unistd_32.h no such file or directory Honaker, Virginia

Sed replace specific line in file Near Earth vs Newtonian gravitational potential Why would a password requirement prohibit a number in the last character? make: *** [sub-make] Error 2 vim +15 arch/x86/include/asm/unistd.h 303395ac arch/x86/include/asm/unistd.h H. make[2]: *** [arch/um/kernel/asm-offsets.s] Error 1 make[2]: Target '__build' not remade because of errors. arch/x86/syscalls/syscall_32.tbl >> for 32-bit arch/x86/syscalls/syscall_64.tbl >> for 64-bit include/linux/syscalls.h An example of adding sys_finit_module: vim /arch/x86/syscalls/syscall_32.tbl 347 i386 process_vm_readv sys_process_vm_readv compat_sys_process_vm_readv 348 i386 process_vm_writev sys_process_vm_writev compat_sys_process_vm_writev 349 i386 kcmp sys_kcmp **350

Peter Anvin 2012-02-19 11 # endif fca460f9 arch/x86/include/asm/unistd.h H. How to get this substring on bash script? Send to Email Address Your Name Your Email Address Cancel Post was not sent - check your email addresses! Peter Anvin 2011-11-11 23 # include :::::: The code at line 15 was first introduced by commit :::::: 303395ac3bf3e2cb488435537d416bc840438fcb x86: Generate system call tables and unistd_*.h from tables :::::: TO:

Join them; it only takes a minute: Sign up unistd_32.h and syscall_table_32.h not found up vote 1 down vote favorite I am building a system call on linux kernel 3.8.0. Peter Anvin 2011-11-11 20 b11caa7c include/asm-x86/unistd.h Adrian Bunk 2008-04-20 21 # else 303395ac arch/x86/include/asm/unistd.h H. Back to top Report #9 ylee ylee King of the Software Page Moderators 1418 posts LocationSouth Carolina, USA Posted 05 January 2012 - 04:25 PM i already have build-essential installed. make[2]: *** [arch/um/kernel/asm-offsets.s] Error 1 make[2]: Target '__build' not remade because of errors.

Several functions may not work. Setting up build-essential (11.4build1) ... but here is something else (still no /usr/include/asm):As far as I can tell Build-essential should install a /usr/include/asm-generic folder. User contributions on this site are licensed under the Creative Commons Attribution Share Alike 4.0 International License.

MOVED This blog has moved to Blogger.com. lrwxrwxrwx 1 root root 41 Jan 5 14:44 acpi -> ../../linux-headers-3.0.0-14/include/acpi lrwxrwxrwx 1 root root 7 Jan 5 17:04 asm -> asm-x86 --------------------------->>>>>>>>>>>>>> LINK BROKEN TOO! (no asm-x86 dir) lrwxrwxrwx 1 Adv Reply October 11th, 2013 #2 alan9800 View Profile View Forum Posts Private Message A Carafe of Ubuntu Join Date Apr 2013 Location 43.49N 7.46E Beans 117 DistroUbuntu 12.04 Precise I make the link corrent and it worked.

It is installed by build-essentials but examining it it is a dependency that installs it. We still need both $(srctree)/$(src) and $(obj) though, so I'm adding them manually. Signed-off-by: Arnd Bergmann --- scripts/Kbuild.include | 2 +- scripts/Makefile.lib | 7 ++++--- 2 files changed, 5 insertions(+), 4 deletions(-) kbuild test robot - June 13, 2016, 9:38 p.m. Originally Posted by sanderj Same question (+answers) here http://stackoverflow.com/questions/1...include-errors ?

Peter Anvin 2012-02-19 7 # ifdef CONFIG_X86_X32_ABI fca460f9 arch/x86/include/asm/unistd.h H. If so delete that old link and relink asm to asm-generic. "No technology can ever be too arcane or complicated for the black t-shirt crowd." Back to top Report #12 stanks Here's the results: /usr/src/linux-headers-3.5.0-17/include/xen/page.h /usr/src/linux-headers-3.5.0-17/include/asm-generic/page.h /usr/src/linux-headers-3.5.0-17/arch/um/include/asm/page.h /usr/src/linux-headers-3.5.0-17/arch/hexagon/include/asm/page.h /usr/src/linux-headers-3.5.0-17/arch/frv/include/asm/page.h /usr/src/linux-headers-3.5.0-17/arch/xtensa/include/asm/page.h /usr/src/linux-headers-3.5.0-17/arch/arm/include/asm/page.h /usr/src/linux-headers-3.5.0-17/arch/alpha/include/asm/page.h /usr/src/linux-headers-3.5.0-17/arch/h8300/include/asm/page.h /usr/src/linux-headers-3.5.0-17/arch/blackfin/include/asm/page.h /usr/src/linux-headers-3.5.0-17/arch/sparc/include/asm/page.h /usr/src/linux-headers-3.5.0-17/arch/x86/include/asm/xen/page.h /usr/src/linux-headers-3.5.0-17/arch/x86/include/asm/page.h /usr/src/linux-headers-3.5.0-17/arch/score/include/asm/page.h /usr/src/linux-headers-3.5.0-17/arch/openrisc/include/asm/page.h /usr/src/linux-headers-3.5.0-17/arch/parisc/include/asm/page.h /usr/src/linux-headers-3.5.0-17/arch/avr32/include/asm/page.h /usr/src/linux-headers-3.5.0-17/arch/tile/include/asm/page.h /usr/src/linux-headers-3.5.0-17/arch/s390/include/asm/page.h /usr/src/linux-headers-3.5.0-17/arch/mips/include/asm/page.h /usr/src/linux-headers-3.5.0-17/arch/cris/include/arch-v32/arch/page.h /usr/src/linux-headers-3.5.0-17/arch/cris/include/asm/page.h /usr/src/linux-headers-3.5.0-17/arch/cris/include/arch-v10/arch/page.h /usr/src/linux-headers-3.5.0-17/arch/mn10300/include/asm/page.h /usr/src/linux-headers-3.5.0-17/arch/microblaze/include/asm/page.h /usr/src/linux-headers-3.5.0-17/arch/c6x/include/asm/page.h /usr/src/linux-headers-3.5.0-17/arch/m68k/include/asm/page.h /usr/src/linux-headers-3.5.0-17/arch/m32r/include/asm/page.h How would you help a snapping turtle cross the road?

Peter Anvin --- 0-DAY kernel test infrastructure Open Source Technology Center https://lists.01.org/pipermail/kbuild-all Intel Corporation kbuild test robot - June 13, 2016, 10:51 p.m. The good news is there is an easy fix. Peter Anvin 2011-11-11 14 303395ac arch/x86/include/asm/unistd.h H. Last edited by alan9800; October 11th, 2013 at 09:29 AM.

On Tuesday, June 14, 2016 6:42:16 AM CEST kbuild test robot wrote: > kernel/time/Kconfig:155:warning: range is invalid > In file included from arch/x86/include/asm/seccomp.h:4:0, > from include/linux/seccomp.h:11, > from include/linux/sched.h:43, > from To find the right file depending on your kernel, use this command (assuming you want to use vim). Is the NHS wrong about passwords? You could for instance install the UEK2 (2.6.39) kernel, which is based on the 3.10 mainstream kernel if I remember correctly and also available. 1 person found this helpful Like Show

Peter Anvin 2011-11-11 16 # define __ARCH_WANT_STAT64 4f2f81a5 arch/x86/include/asm/unistd.h H. If you need more details (.config?), please ask.Regards,Peter [1]: http://lkml.org/lkml/2012/3/19/680        Last update: 2013-07-15 22:21    [W:0.023 / U:291.664 seconds]©2003-2016 Jasper Spaans. Peter Anvin 2011-11-11 29 b11caa7c include/asm-x86/unistd.h Adrian Bunk 2008-04-20 30 # endif 303395ac arch/x86/include/asm/unistd.h H. In nomenclature, does double or triple bond have higher priority?

This tool uses JavaScript and much of it will not work correctly without it enabled. Altern likes this "No technology can ever be too arcane or complicated for the black t-shirt crowd." Back to top Report #8 stanks stanks Member Members 31 posts LocationCroatia Posted 05 The ubuntu packagers moved things around and the location of the header files that used to be in /usr/include/asm are now in /usr/include/asm-generic To fix, just add a link:sudo ln -s Please enter a title.

Remya Valappil-Oracle Oct 16, 2014 12:02 PM (in response to Dude!) Thanks Dude! Become a Bodhi Linux Member and get your own @BodhiLinux.com email address! [SOLVED] kernel header files missing Started by stanks, Jan 05 2012 02:25 PM Please log in to reply 14 Peter Anvin 2011-11-11 22 303395ac arch/x86/include/asm/unistd.h H. Peter Anvin 2011-11-11 25 # define __ARCH_WANT_COMPAT_SYS_TIME 0473c9b5 arch/x86/include/asm/unistd.h Heiko Carstens 2014-03-03 26 # define __ARCH_WANT_COMPAT_SYS_GETDENTS64 378a10f3 arch/x86/include/asm/unistd.h Heiko Carstens 2014-03-05 27 # define __ARCH_WANT_COMPAT_SYS_PREADV64 378a10f3 arch/x86/include/asm/unistd.h Heiko Carstens 2014-03-05 28

Peter Anvin 2012-01-19 17 # define __ARCH_WANT_SYS_IPC 303395ac arch/x86/include/asm/unistd.h H. Peter Anvin 2012-02-19 10 # define __SYSCALL_MASK (~0) fca460f9 arch/x86/include/asm/unistd.h H. Hi, [auto build test ERROR on kbuild/for-next] [also build test ERROR on v4.7-rc3 next-20160609] [if your patch is applied to the wrong git tree, please drop us a note to help Adv Reply October 11th, 2013 #3 Bond112 View Profile View Forum Posts First Cup of Ubuntu Join Date Oct 2013 Beans 3 Re: Having trouble compiling C code on ubuntu.

Adv Reply Quick Navigation Programming Talk Top Site Areas Settings Private Messages Subscriptions Who's Online Search Forums Forums Home Forums The Ubuntu Forum Community Ubuntu Official Flavours Support New to Peter Anvin 2012-02-19 8 # define __SYSCALL_MASK (~(__X32_SYSCALL_BIT)) fca460f9 arch/x86/include/asm/unistd.h H. Peter Anvin 2011-11-11 22 303395ac arch/x86/include/asm/unistd.h H. Peter Anvin 2011-11-11 16 # define __ARCH_WANT_STAT64 4f2f81a5 arch/x86/include/asm/unistd.h H.

Username Forum Password I've forgotten my password Remember me This is not recommended for shared computers Sign in anonymously Don't add me to the active users list Privacy Policy current community I still haven't been able to compile it though. Do you want to help us debug the posting issues ? < is the place to report it, thanks ! hosted at Digital OceanAdvertise on this site  Skip navigationOracle Community DirectoryOracle Community FAQLog inRegisterMy Oracle Support Community (MOSC)SearchSearchCancelGo Directly To Oracle Technology Network CommunityMy Oracle Support CommunityOPN Cloud ConnectionOracle Employee CommunityOracle

I still haven't been able to compile it though. Peter Anvin 2011-11-11 2 #define _ASM_X86_UNISTD_H 1 303395ac arch/x86/include/asm/unistd.h H. More discussions in Oracle Linux and UEK Beta Testing All PlacesServer & Storage SystemsLinuxOracle Linux and UEK Beta Testing This discussion is archived 4 Replies Latest reply on Oct 17, 2014 May 5, 2010 in Bugs.

long sys_helloworldThere is a file called unistd.h. Remya Valappil-Oracle Oct 16, 2014 10:52 AM I was trying to compile Clearcase mvfs module on kernel version 3.8.13-35.1.2.el6uek.x86_64(OS is OL6u4) and I'm getting this error: ----------------- rm -rf *.o *.kobj Dude! Oct 16, 2014 11:02 AM (in response to Remya Valappil-Oracle) The kernel header files as of OL 6 are included in the kernel-devel package.