gcc make error 126 Walburg Texas

Address 4159 E University Ave, Georgetown, TX 78626
Phone (512) 869-3015
Website Link
Hours

gcc make error 126 Walburg, Texas

asked 5 years ago viewed 46858 times active 1 year ago Related -2Can you explain me about following make file of “lc” tool3How to list prerequisites externally in GNU Make?2How can In each of your examples, ./dpp cannot be executed. I believe that the version of make you have is invoking commands directly, and/or using command.com. Are you then trying to compile it in AVR Studio?

Follow Us TI Worldwide | Contact Us | my.TI Login | Site Map | Corporate Citizenship | m.ti.com (Mobile Version) TI is a global semiconductor design and manufacturing company. Top Fri, 2011-05-13 10:53 #5 CodeRedSupport Offline Joined: 2009-12-06 Posts: 4268 Please build and post the entire contents of the build Console, so we can see the whole output from the share|improve this answer answered Apr 15 '13 at 17:34 reinierpost 5,54911849 I do already have junctions (Program and Programx86). See Functions for Transforming Text. ‘missing target pattern.

I still see this error: g++ -m64 -c -Wall -O3 -msse2 -Wno-unknown-pragmas -funroll-loops -fopenmp -fPIC -o updater.o src/tree/updater.cpp src/tree/updater.cpp:1:0: warning: -fPIC ignored for target (all code is position independent) // Copyright This is what problems view shows: Quote:Description Resource Path Location Type make: *** [blinky.axf] Error 1 blinky line 0 C/C++ Problem make: *** [libCMSISv1p30_LPC11xx.a] Error 126 CMSISv1p30_LPC11xx line 0 C/C++ Problem You are right, I should have posted text instead of image: Code: eee-virtual-machine lxlauncher-0.1.6-jemimah-puppy-menu-patches # make install Making install in src make[1]: Entering directory `/home/eee/lxlauncher-0.1.6-jemimah-puppy-menu-patches/src' make[2]: Entering directory `/home/eee/lxlauncher-0.1.6-jemimah-puppy-menu-patches/src' test -z How can I do the complete removal of the IDE including the registry keys?

Although I had the same feeling when I first saw C:\Program, this was not the problem. Find More Posts by matthewg42 09-25-2007, 04:37 AM #3 vadirajcs LQ Newbie Registered: Jun 2004 Location: India Distribution: Red Hat Posts: 20 Original Poster Rep: Quote: Originally Posted by Why does argv include the program name? Note that registered members see fewer ads, and ContentLink is completely disabled once you log in.

The first means there’s no pattern in the target section of the rule; the second means there are multiple patterns in the target section; the third means the target doesn’t contain Theres no problem with the code i think. current community chat Stack Overflow Meta Stack Overflow your communities Sign up or log in to customize your list. Chebyshev Rotation How to show hidden files in Nautilus 3.20.3 Ubuntu 16.10?

This is not allowed; either use simply-expanded variables (‘:=’ or ‘::=’) or use the append operator (‘+=’). it executes properly. Product content has moved to nxp.com. In this case, you really need to find out why and resolve the issue.

Jan 8, 2008 - 02:52 AM 12345Total votes: 0 Is this your own code or something written by somebody else? Thanks. #31 | Posted 13 months ago Permalink phunter Posts 208 | Votes 219 Joined 18 Jun '13 | Email User 0 votes @phunter I am using a MAC and pip This is free software; see the source for copying conditions. Stop.’ This means that make could not understand much of anything about the makefile line it just read.

I'm ok until the point 6). Eric Weddington www.linkedin.com/in/ericweddington/ Log in or register to post comments Top js Level: Moderator Joined: Wed. the compiler still refuses to work. The compilation doesn't finish.

As I experiment with various revisions of my target specification, I often get a variety of error messages when attempting to call make. You say it compiles fine in a command prompt on Vista. Coyote Website Re: make: *** [lib/libCint.so] Error 126 on Ubuntu 12.04 Quote Unread postby Wile E. Indeed I don't see the file librabit_empty.a in the directory.

I mean How to rewrite this code in to TMS470 Compiler will understand? __asm__ __volatile__("swpb %0, %1, [%2]" :"=&r" (ret) :"r" (x), "r" (ptr) :"memory"); Regards, Subhashini Reply Cancel Cancel Forum content and FAQs have been moved to community.nxp.com. Jan 8, 2008 Posts: 6 View posts #6 Posted by schinoy: Tue. See Rule Syntax. ‘No rule to make target `xxx'.’ ‘No rule to make target `xxx', needed by `yyy'.’ This means that make decided it needed to build a target, but then

Success! because it gets converted to the object and hex files successfully. more stack exchange communities company blog Stack Exchange Inbox Reputation and Badges sign up log in tour help Tour Start here for a quick overview of the site Help Center Detailed See Rule Syntax. ‘recipe commences before first target.

I just had to update your own SO question with the latest (third) diagnosis (32/64b incompatible versions of msys on path) and tags. Add `+' to parent make rule.’ In order for make processes to communicate, the parent will pass information to the child. You're using the mingw version of make; that version (as I understand it) does NOT use bash as the shell to run commands in: it's supposed to be used with native We greatly appreciate your contributions and look forward to seeing you at our new web location.

Is it a known issue? Start Watching View all posts « Back to forum © 2016 Kaggle Inc Our Team Careers Terms Privacy Contact/Support How to handle a senior developer diva who seems unaware that his skills are obsolete? I still see this error: g++ -m64 -c -Wall -O3 -msse2 -Wno-unknown-pragmas -funroll-loops -fopenmp -fPIC -o updater.o src/tree/updater.cpp src/tree/updater.cpp:1:0: warning: -fPIC ignored for target (all code is position independent) // Copyright

Coyote » Sun Apr 19, 2015 12:59 Something went terribly wrong when unpacking ROOT (file mode bits are very wrong -> they should be "-rwxr-xr-x" for all of them).Try (simply replace TX errors with c_can.. The compilation doesn't finish. UNIX is a registered trademark of The Open Group.

DistroUbuntu 15.10 Wily Werewolf Re: Compiling from source code - make install error 126 Hi you have to run make install with sudo (i mean as a root .) so change Is there anything that I missed? After extract to the site-packages folder. User contributions on this site are licensed under the Creative Commons Attribution Share Alike 4.0 International License.

How you fix it? its only the eep,lss and sym files that are at times not formed successfully.