gcc 4.4.1 asm error Vanleer Tennessee

Address 204 N Main St Ste 4, Dickson, TN 37055
Phone (615) 446-5448
Website Link http://www.scottscomputers.com
Hours

gcc 4.4.1 asm error Vanleer, Tennessee

more stack exchange communities company blog Stack Exchange Inbox Reputation and Badges sign up log in tour help Tour Start here for a quick overview of the site Help Center Detailed All rights reserved. It is an error to separate the macro name and the macro parameter list with a space. Rob's patch works for me.

How should I solve this error? Join them; it only takes a minute: Sign up Here's how it works: Anybody can ask a question Anybody can answer The best answers are voted up and rise to the Related Published Jun 7, 2011 Do not republish this article, in whole or in part, on any other website. make[2]: *** [_udivsi3.o] Error 1 make[2]: Leaving directory `/media/COMMON/WorkSpace/Packages/gcc-4.4.3/arm-linux/libgcc' make[1]: *** [all-target-libgcc] Error 2 make[1]: Leaving directory `/media/COMMON/WorkSpace/Packages/gcc-4.4.3' make: *** [all] Error 2 I have cross compiled gcc dependencies that are

Email check failed, please try again Sorry, your blog cannot share posts by email. %d bloggers like this: virtualbox.org End user forums for VirtualBox Advanced search Board index Change font size I have not had time to try this out yet. For long macros, or for better formatting, the macro can be defined over several lines by ending each line with a backslash character (\) and a new line (enter) (extra spaces make[2]: *** [all-stage1-target-libgcc] Error 2 make[1]: *** [stage1-bubble] Error 2 make: *** [bootstrap] Error 2 this is on Intel Mac OS X 10.5.8 Attachments gcc44.log​ (629.2 KB) - added by [email protected]

comment:3 follow-up: ↓ 4 Changed 7 years ago by [email protected]… On Tue, Sep 1, 2009 at 02:11, Rob Mahurin wrote: I was able to compile gcc44 after changing the Portfile as attached. First I do a "make clean". How to show hidden files in Nautilus 3.20.3 Ubuntu 16.10? date: invalid date '2016-10-16' What are oxidation states used for?

Removing the space fixes the problem. Index Nav: [DateIndex] [SubjectIndex] [AuthorIndex] [ThreadIndex] Message Nav: [DatePrev][DateNext] [ThreadPrev][ThreadNext] Other format: [Raw text] "#error Unable to determine architecture." while compiling gcc-4.4.x for arm-none-linux-gnueabi From: Phil Couling

Why can't we use the toilet when the train isn't moving? Thanks. 2009-10-07 Namhyung Kim * doc/extend.texi (Extended Asm): fix compile error of a example code. comment:8 Changed 6 years ago by [email protected]… Do you still see this problem with version 4.4.3? Error: Target org.macports.build returned: shell command " cd "/opt/local/var/macports/build/_opt_local_var_macports_sources_rsync.macports.org_release_ports_lang_gcc44/work/build" && /usr/bin/make -j2 bootstrap " returned error 2 Command output: ../../../../gcc-4.4.1/libgcc/../gcc/config/soft-fp/fixunstfdi.c:35: warning: no previous prototype for '__fixunstfdi' /opt/local/var/macports/build/_opt_local_var_macports_sources_rsync.macports.org_release_ports_lang_gcc44/work/build/./gcc/xgcc -B/opt/local/var/macports/build/_opt_local_var_macports_sources_rsync.macports.org_release_ports_lang_gcc44/work/build/./gcc/ -B/opt/local/i386-apple-darwin9.8.0/bin/ -B/opt/local/i386-apple-darwin9.8.0/lib/ -isystem

I have succeeded to build STLport by fixing the Makefile, however, I'm not sure if it's work or not, right now. /linux/lib/STLport/Makefile: # # Makefile for building the std c++ library make[5]: *** [obj/gcc/shared/dll_main.o] Fel 1 make[5]: Lmnar katalogen "/home/henrik/Skrivbord/Programvara/LantronixXPort-Pro/Linux-SDK/linux/lib/STLport/build/lib" make[4]: *** [all] Fel 2 . . . I've tried all of the 4.4.x versions, but for each one I get the following error: ../../../../gcc-4.4.1/libgcc/../gcc/config/arm/lib1funcs.asm:103:2: error: #error Unable to determine architecture. Last modified: 2009-05-07 22:18:44 UTC Home | New | Browse | Search | [?] | Reports | Help | NewAccount | Log In Remember [x] | Forgot Password Login: [x] User

patch from rob Change History Changed 7 years ago by [email protected]… Attachment gcc44.log​ added full debug log comment:1 Changed 7 years ago by [email protected]… full debug build log attached comment:2 Changed [email protected]:~/src/lantronix/sdk/linux/include$ ln -s ../../toolchains/freescale-coldfire-4.4/m68k-uclinux/include/c++/4.4.1/ 4.4.1 A patch with a more permanent solution to the error would be appreciated. Confirmed: patch has fixed broken gcc441 build. I tried to run the patch in /opt/local/var/macports/ and it asked me a file name.

What's behind the word "size issues"? Thx for the patch! $ port version Version: 1.8.0 $ uname -a Darwin mzs-macbook-pro.local 9.8.0 Darwin Kernel Version 9.8.0: Wed Jul 15 16:55:01 PDT 2009; root:xnu-1228.15.4~1/RELEASE_I386 i386 comment:6 Changed 7 years What would be the atomic no. If so, is everybody experiencing it on Leopard on Intel or is anybody seeing the problem on other platforms as well?

Macros are a simple text substitution done by the preprocessor. These are the steps that I followed to cross-compile gcc on ARM: export CROSS_COMPILER="arm-linux-" export CC="arm-linux-gcc" export ARCH="arm" ./configure --host=arm-linux --prefix=/media/COMMON/WorkSpace/Applications/Vital-TrackIII/Build_gcc --enable-languages=c --disable-multilib --with-float=soft --disable-sjlj-exceptions --disable-shared --enable-libgomp --disablenls --enable-threads=posix --disable-libmudflap --disable-libssp Whenever the macro name is encountered in your code, the preprocessor replaces it with the text to the right of the macro name (plugging in any optional parameters you may have New Ticket     Tickets     Wiki     Browse Source     Timeline     Roadmap     Ticket Reports     Search Search: Context Navigation ← Previous TicketNext

Previous message: Installing asterisk 1.6.1.1 in snow leopard Next message: can't install gcc43 or gcc44 Messages sorted by: [ date ] [ thread ] [ subject ] [ author ] More GCC_HOST_TYPE = $(subst linux-,linux,$(CROSS_COMPILE)) ifdef BUILD_SHARED OPT += -I$(TOP_DIR)/include/c++/$(GCC_HOST_TYPE)/mid-shared-library else OPT += -I$(TOP_DIR)/include/c++/$(GCC_HOST_TYPE)/msep-data endif OPT += -I$(TOP_DIR)/include/STLport OPT += -D_STLP_NATIVE_INCLUDE_PATH=../c++ endif all: # fixed # make -C build/lib -f uclinux-dist.mak install Johan Adler08-13-2010, 12:59 PMSTRIP -x -R .note -R .comment lib/libc.a AR cr lib/libc.a make[4]: Leaving directory `/home/jadler/src/lantronix/sdk/linux/uClibc' make[3]: Leaving directory `/home/jadler/src/lantronix/sdk/linux/lib' make[3]: Entering directory `/home/jadler/src/lantronix/sdk/linux/include' find . -depth -type l -a I am not sure which directory contains the problem file.

When they have bugs, they are a pain to troubleshoot. ucfront-gcc m68k-uclinux-gcc -mcpu=5208 -DCONFIG_COLDFIRE -O2 -g -fomit-frame-pointer -pipe -fno-common -fno-builtin -Wall -DEMBED -fno-dwarf2-cfi-asm -msep-data -Dlinux -D__linux__ -Dunix -D__uClinux__ -fPIC -c -o gzio.o gzio.c ucfront-gcc m68k-uclinux-gcc -mcpu=5208 -DCONFIG_COLDFIRE -O2 -g -fomit-frame-pointer -pipe UNIX is a registered trademark of The Open Group. Henrik Borg05-05-2010, 03:58 PMRealised I missed a couple of important lines: make[5]: Gr till katalogen "/home/henrik/Skrivbord/Programvara/LantronixXPort-Pro/Linux-SDK/linux/lib/STLport/build/lib" ucfront-g++ m68k-uclinux-g++ -m5307 -DCONFIG_COLDFIRE -pthread -fexceptions -fident -fPIC -O2 -fuse-cxa-atexit -D_STLP_REAL_LOCALE_IMPLEMENTED -D_GNU_SOURCE -I/home/henrik/Skrivbord/Programvara/LantronixXPort-Pro/Linux-SDK/linux/include/STLport -I/home/henrik/Skrivbord/Programvara/LantronixXPort-Pro/Linux-SDK/linux/include -c

I keep hitting the same error, with STLport being autoselected, not forced by me. Fortunately, \ it is possible to spread the line over several \ lines by using the backslash character

Not Working Examples: The following macro won't compile following expansion (it is The help on patches says that I should go to the directory containing the file to be patched, and then run the command to apply the patch and the patchfile should Animal Shelter in Java In the United States is racial, ethnic, or national preference an acceptable hiring practice for departments or companies in some situations?

Go report bugs to the gcc team. ------------------------------------------------------------------------------------------------------------- So here it is: I built gcc using default CFLAGS etc and I configured mplayer with --enable-gui and default CFLAGS. There is NO warranty; not even for MERCHANTABILITY or FITNESS FOR A PARTICULAR PURPOSE. | awk 'BEGIN { FS = "."; } { print $3; }'' make[5]: Entering directory `/home/jadler/src/lantronix/sdk/linux/lib/STLport/build/lib' ucfront-g++ comment:10 Changed 6 years ago by [email protected]… Status changed from new to closed Resolution set to fixed Note: See TracTickets for help on using tickets. Can cats leave scratch marks on cars?

I'm building using the following to configure: ../gcc-$GCC_VERSION/configure --host=arm-none-linux-gnueabi --prefix=$HOME/built --with-gmp=$HOME/tools --with-mpfr=$HOME/tools Other package versions are: BINUTILS_VERSION=2.19 GMP_VERSION=5.0.1 MPFR_VERSION=2.4.2 Any suggestions? Download in other formats: Comma-delimited Text Tab-delimited Text RSS Feed Complete, Concrete, Concise Practical information without the bloat   Home  Privacy Home » Programming » C++ Compilation Error - Improperly Defined Macro Macros