fatal_error maven embedder execution error Liberty Center Ohio

Computers, monitors, printers, computer service, printer service, new toner cartridges, compatible toner cartridges, inkjet cartridges

Address 236 New Towne Square Dr, Toledo, OH 43612
Phone (419) 476-2552
Website Link http://www.rtmicrocenters.com
Hours

fatal_error maven embedder execution error Liberty Center, Ohio

I am currently using the 1.5.2 version of it.Google Code Homepage : http://code.google.com/p/gwt-maven/Maven 2 Plugin Doc : http://gwt-maven.googlecode.com/...A list of some problems : http://code.google.com/p/gwt-maven/wiki/FAQMaven Repo : http://gwt-maven.googlecode.com/...SVN Repository : http://gwt-maven.googlecode.com/.../and as Does chilli get milder with cooking? The idea of FleXPlanner rocks! Running com.l2jfree.gameserver.templates.TestL2NpcTemplate Tests run: 2, Failures: 0, Errors: 0, Skipped: 0, Time elapsed: 0.063 sec Results : Failed tests: Tests run: 30, Failures: 2, Errors: 0, Skipped: 0 [INFO] ------------------------------------------------------------------------ [ERROR]

Oracle and Java are registered trademarks of Oracle and/or its affiliates. Please type your message and try again. 3 Replies Latest reply on Feb 21, 2008 2:06 PM by Bruce Snyder Problem with Maven2 - Requested download does not exist. All rights reserved. INFO : MLog clients using log4j logging.

Tests run: 3, Failures: 0, Errors: 0, Skipped: 0, Time elapsed: 0.094 sec Running com.l2jfree.gameserver.templates.TestL2PcTemplate Tests run: 1, Failures: 0, Errors: 0, Skipped: 0, Time elapsed: 0.094 sec Running com.l2jfree.gameserver.jdklogextensions.ItemLogFormatterTest Tests I am a big Maven 2 fan because in an Enterprise (captial E for 'ooh' fancy) environment, standards go a LONG way and Maven 2 dictates a nice and well understood Consult the following stack trace for details. archetype:create No archetype repository found.org.apache.maven.archetype.downloader.DownloadNotFoundException: Requested download does not exist.at org.apache.maven.archetype.downloader.DefaultDownloader.download(DefaultDownloader.java:62)at org.apache.maven.archetype.common.DefaultArchetypeArtifactManager.exists(DefaultArchetypeArtifactManager.java:298)at org.apache.maven.archetype.ui.DefaultArchetypeGenerationConfigurator.configureArchetype(DefaultArchetypeGenerationConfigurator.java:102)at org.apache.maven.archetype.mojos.CreateProjectFromArchetypeMojo.execute(CreateProjectFromArchetypeMojo.java:167)at org.apache.maven.plugin.DefaultPluginManager.executeMojo(DefaultPluginManager.java:412)at org.apache.maven.lifecycle.DefaultLifecycleExecutor.executeGoals(DefaultLifecycleExecutor.java:534)at org.apache.maven.lifecycle.DefaultLifecycleExecutor.executeStandaloneGoal(DefaultLifecycleExecutor.java:488)at org.apache.maven.lifecycle.DefaultLifecycleExecutor.executeGoal(DefaultLifecycleExecutor.java:458)at org.apache.maven.lifecycle.DefaultLifecycleExecutor.executeGoalAndHandleFailures(DefaultLifecycleExecutor.java:306)at org.apache.maven.lifecycle.DefaultLifecycleExecutor.executeTaskSegments(DefaultLifecycleExecutor.java:219)at org.apache.maven.lifecycle.DefaultLifecycleExecutor.execute(DefaultLifecycleExecutor.java:140)at org.apache.maven.DefaultMaven.doExecute(DefaultMaven.java:361)at org.apache.maven.DefaultMaven.execute(DefaultMaven.java:150)at org.apache.maven.embedder.MavenEmbedder.execute(MavenEmbedder.java:690)at org.maven.ide.eclipse.Maven2Executor.main(Maven2Executor.java:112)Caused by: org.apache.maven.artifact.resolver.ArtifactNotFoundException: Unable to download the

Especially considering that I got a success message when I installed the flex compiler mojo manually. java:39) at sun.reflect.DelegatingMethodAccessorImpl.invoke(DelegatingMethodAcces sorImpl.java:25) at java.lang.reflect.Method.invoke(Method.java:597) at org.codehaus.plexus.compiler.javac.JavacCompiler.compileInProcess(Jav acCompiler.java:420) at org.codehaus.plexus.compiler.javac.JavacCompiler.compile(JavacCompile r.java:141) at org.apache.maven.plugin.AbstractCompilerMojo.execute(AbstractCompiler Mojo.java:493) at org.apache.maven.plugin.CompilerMojo.execute(CompilerMojo.java:114) at org.apache.maven.plugin.DefaultPluginManager.executeMojo(DefaultPlugi nManager.java:451) at org.apache.maven.lifecycle.DefaultLifecycleExecutor.executeGoals(Defa ultLifecycleExecutor.java:558) at org.apache.maven.lifecycle.DefaultLifecycleExecutor.executeGoalWithLi fecycle(DefaultLifecycleExecutor.java:499) at org.apache.maven.lifecycle.DefaultLifecycleExecutor.forkProjectLifecy cle(DefaultLifecycleExecutor.java:924) at org.apache.maven.lifecycle.DefaultLifecycleExecutor.forkLifecycle(Def If Dumbledore is the most powerful wizard (allegedly), why would he work at a glorified boarding school? java.lang.OutOfMemoryError: Java heap space at com.sun.tools.javac.util.Log.useSource(Log.java:211) at com.sun.tools.javac.comp.MemberEnter.complete(MemberEnter.java:959) at com.sun.tools.javac.code.Symbol.complete(Symbol.java:386) at com.sun.tools.javac.code.Symbol$ClassSymbol.complete(Symbol.java:758) at com.sun.tools.javac.comp.Enter.complete(Enter.java:451) at com.sun.tools.javac.comp.Enter.main(Enter.java:429) at com.sun.tools.javac.main.JavaCompiler.enterTrees(JavaCompiler.java:81 9) at com.sun.tools.javac.main.JavaCompiler.compile(JavaCompiler.java:727) at com.sun.tools.javac.main.Main.compile(Main.java:353) at com.sun.tools.javac.main.Main.compile(Main.java:279) at com.sun.tools.javac.main.Main.compile(Main.java:270) at com.sun.tools.javac.Main.compile(Main.java:87) at sun.reflect.NativeMethodAccessorImpl.invoke0(Native

Related 339Get source JARs from Maven repository372Force maven update584How to solve “Plugin execution not covered by lifecycle configuration” for Spring Data Maven Builds0Android - maven - build error4Maven proxy settings not Tests run: 3, Failures: 0, Errors: 0, Skipped: 0, Time elapsed: 0.079 sec Running com.l2jfree.gameserver.templates.TestL2PcTemplate Tests run: 1, Failures: 0, Errors: 0, Skipped: 0, Time elapsed: 0.047 sec Running com.l2jfree.gameserver.jdklogextensions.ItemLogFormatterTest Tests On 4/6/07, Hodanics, Charles J. <[hidden email]> wrote: > > Can someone assist with the following error when I run Maven2 compile > from eclipse and continuum. Marian Mroz Feb 18, 2008 10:54 AM I have a little problem with create Java Business Integration Service Units.

Error = The end-tag for element type "Droplis" must end with a '>' delimiter. Bruce Like Show 0 Likes(0) Actions Go to original post Actions Related Issues Retrieving data ... I found the problem (after downloading the src and corrected it) and logged this issue with a patch @ GWT M2 Plugin Issue 43So .. His experience is vast across all areas of IT.

Have you stumbled across something similiar to my problem: Issue 63 (Just reported the issue)Thanks again for the blog entry!Stefan 10 October 2007 at 08:56 huherto said... It turns out that my company Maven 2.0.8 installation has a modified conf/settings.xml to connect to enterprise central repository. HTML код Выкл.Trackbacks are Выкл. It should be http://svn.sonatype.org/flexmojos/repository instead of http://svn.sonatype.org/flexmojos.

I'm sure part of the problem is me. Running com.l2jfree.gameserver.templates.TestL2NpcTemplate Tests run: 2, Failures: 0, Errors: 0, Skipped: 0, Time elapsed: 0.047 sec Results : Failed tests: Tests run: 30, Failures: 2, Errors: 0, Skipped: 0 [INFO] ------------------------------------------------------------------------ [ERROR] How do investigators always know the logged flight time of the pilots? Error = The end-tag for element type "Droplis" mu st end with a '>' delimiter.

With the passing of Thai King Bhumibol, are there any customs/etiquette as a traveler I should be aware of? Pronuncia strana della "s" dopo una "r": un fenomeno romano o di tutta l'Italia? Every time I see the same communicate:////////////////////// Scanning for projects... I've tweaked the binary we ship to be recognized as 2.0.4.

I tried using maven twice for projects at work. I am this close to saying "Maven sucks" but holding it back because it works fine for all my other projects except this one. It would be great to see a settings.xml, and pom.xml because I can't figure this one out. The issue can be worked around by specifying the exact version of the maven-archetype plugin to use right on the command line like so: $ mvn org.apache.maven.plugins:maven-archetype-plugin:1.0-alpha-7:create ...

Funny enough, I have an SVN downloaded script that works to "download" src from SVN repositories using wget.See the end of this post for the shell script.So .. I found on the internet that everything it's work withmaven-archetype-plugin:1.0-alpha-7but could anybody tell me how:1.Uninstall maven-archetype-plugin:2.0-alpha-1 2.Install maven-archetype-plugin:1.0-alpha-73.Disable automatic download new version maven-archetypeMario Like Show 0 Likes(0) Actions 3. I have checked a few posts and seen that > JRE to JDK is a fix, but I already have this done. > > > [INFO] Compiling 35 source files to GroupId: info.rvin.mojo ArtifactId: flex-compiler-mojo Version: 1.0 Reason: Unable to download the artifact from any repository info.rvin.mojo:flex-compiler-mojo:pom:1.0 from the specified remote repositories: central (central repository), epseelon-repository (http://m2repo.epseelon.org/), flex-mojos-repository (http://svn.sonatype.org/flexmojos/repository/) Frustrating long weekend

Wanted 2 got 0 [ERROR]VM #menuItem: error : too few arguments to macro. true; trace: 10] INFO : Initializing c3p0 pool... hack self brain. Can someone help me to fix it? [FATAL ERROR] org.apache.maven.plugin.clean.CleanMojo#execute() caused a linkage error (java.lang.NoClassDefFoundError) and may be out-of-date.

You also need to update the versions for your Flex dependencies to be 3.0.0.477 instead of 3.0.0.3.0.0.477 otherwise you're likely to run into problems later. Subject: Re: [appfuse-user] Spring MVC basic exception in IDEA at hibernate3:hbm2ddl Date: Wed, 14 Nov 2007 00:54:39 -0800 (PST) Mailing-list: contact [email protected]; run by ezmlm HiMatt, Thanksforansweringmyquestion.You'reright,itseemstobeanIDEA problemsinceitworksfineviatheconsole.I'lltalktotheguysfrom JetBrainstohavealookattheproblem. Consult the following stack trace for details. well to checkout the src from the subversion repository, you get this nice little gem.$ svn co http://gwt-maven.googlecode.com/svn/trunk/maven-googlewebtoolkit2-plugin/ svn: REPORT request failed on '/svn/!svn/vcc/default' svn: REPORT of '/svn/!svn/vcc/default': 400 Bad Request

share|improve this answer answered Aug 21 '12 at 10:54 kothvandir 1,05811019 add a comment| up vote 0 down vote i have faced the same problem, but later i found very simple I'm in a very similar position to you. Sed replace specific line in file Why are Spanish adverbs formed using the feminine? com.mchange.v2.c3p0.ComboPooledDataSource [ jav a.beans.IntrospectionException: java.lang.reflect.InvocationTargetException [num ThreadsAwaitingCheckoutDefaultUser] ] 01.10.2008 0:01:04 com.l2jfree.gameserver.datatables.SkillTreeTable SEVERE: Error while creating skill tree (Class ID 0):java.sql.SQLException: L2Da tabaseFactory: Failed to init database connections: java.lang.NullPointerExcepti on 01.10.2008

Pingbacks are Выкл. Marian Mroz Feb 20, 2008 6:46 AM (in response to Bruce Snyder) I've found where is the problem, but I don't know how resolved it.