fatal error c1083 vc Hobbsville North Carolina

Some of our services include:Computer Repair or Tune-upComputer Set-upData Backup / TransferData Recovery & Cloud SolutionsEmail SetupHardware Install or RepairNetwork InstallationOperating System InstallPrinter Setup or TroubleshootingSoftware Install & SetupVirus, Malware, & Spyware RemovalWireless Networking

Address 318 Curtis St S, Ahoskie, NC 27910
Phone (252) 862-3925
Website Link http://www.ahoskiecomputerrepair.com
Hours

fatal error c1083 vc Hobbsville, North Carolina

Opportunities for recent engineering grads. I changed command line root directory to just D:> and run configure again. I pointed my path at both the main VC folder in Visual Studio 14.0 and at the amd64 folder. So the above changed to: cl /I "C:\Program Files (x86)\Microsoft Visual Studio 10.0\VC\include" /I "C:\Program Files\MySQL\MySQL Server 5.5\include" mysql1.c 2.

asked 5 years ago viewed 6803 times active 10 months ago Get the weekly newsletter! I see this is closed, but don't see the solution. Reason files where not in the include folder. Please make sure that you are using Erlang / OTP version 17.0 or later and that you have a C compiler installed.

In the meantime, any feedback you can give us will be very helpful. This is the first time I've used Microsoft's compiler. cl /O2 /EHsc /I"c_src" /I"c:/Program Files/erl7.1/erts-7.1/include" /LD /MD /Fepriv\bcrypt_nif.dll c_src\bcrypt_nif.c c_src\blowfish.c Microsoft (R) C/C++ Optimizing Compiler Version 19.00.23506 for x86 Copyright (C) Microsoft Corporation. they should already be included in your source code.

I ran this: "C:\program files (x86)\Microsoft Visual Studio 14.0\VC> vcvarsall amd64" before I tried to compile. Please help. Ran the vcvarsall command. For example, C++ Copy #include might not find the file you intend.

Are independent variables really independent? Thank you :) I blame the platform for being so conductive of non-boring bug reports. Yes No Additional feedback? 1500 characters remaining Submit Skip this Thank you! How do investigators always know the logged flight time of the pilots?

You signed out in another tab or window. Then it was able to compile correctly. Or maybe my wallpaper is incompatible...     C:\Program Files (x86)\Microsoft Visual Studio 10.0\VC\include\intrin.h(26): fatal error C1083: Cannot open include file: 'ammintrin.h': No such file or directory I then travelled to lands NMAKE : fatal error U1077: '"c:\program files (x86)\Microsoft Visual Studio 14.0\VC\bin\amd64\cl.EXE"' : return code '0x 2' Stop. ==> comeonin could not compile dependency :comeonin, "mix compile" failed.

Even when header files are listed in Solution Explorer as part of a project, the files are only found by the compiler when they are referred to by an include or Is "halfly" a word? share|improve this answer answered Nov 18 '10 at 16:22 Steve Townsend 41.9k453109 I have only one project... –rsjethani Nov 18 '10 at 16:46 @ryanlancer - then @Brian Close some applications and then recompile.

Compiling Qt/C++ program2(Special case, might related to VC directory setting) fatal error C1083: Cannot open include file: 'iostream.h': No such file or directory4Why am I receiving this error when I attempt Play games and win prizes! NMAKE : fatal error U1077: '"C:\Program Files (x86)\Microsoft Visual Studio 14.0\VC\BIN\cl.EXE"' : return code '0x2' Stop. ==> comeonin could not compile dependency :comeonin, "mix compile" failed. You can use your browser to save the content of the link to a file.

Jin Hwa Kim Jin Hwa Kim (view profile) 0 questions 2 answers 0 accepted answers Reputation: 0 on 10 Nov 2015 Direct link to this comment: https://www.mathworks.com/matlabcentral/answers/90383#comment_321978 cooooool! You’ll be auto redirected in 1 second. Your Answer draft saved draft discarded Sign up or log in Sign up using Google Sign up using Facebook Sign up using Email and Password Post as a guest Name Personal Open source Business Explore Sign up Sign in Pricing Blog Support Search GitHub This repository Watch 9 Star 387 Fork 36 riverrun/comeonin Code Issues 3 Pull requests 1 Projects

I was playing around with the settings, one time I changed the platform from Active(Win32) to Win32, then suddenly the compiling works, but after that time I couldn't reproduce it any That's all for now. One option is to install a recent version of Visual Studio (the free Community edition will be enough for this task). Should I oblige when a client asks to use a design as a logo when it wasn't made to be the logo in the first place?

As I mentioned in my previous post, there is probably a better fix than this, but this worked quickly for now anyway. 6. Hope this helps. Owner riverrun commented Feb 12, 2016 Glad you solved it in the end. I will show you how they installed when I get home from work.

It would not be found by this include directive. Sign in to comment Contact GitHub API Training Shop Blog About © 2016 GitHub, Inc. For more information about the per-user and per-project directories searched by the compiler in Visual Studio, see VC++ Directories Property Page. asked 4 years ago viewed 542 times active 4 years ago Linked 24 vs. vs. “iostream.h” 3 C1083: Cannot open include file: math.h: No such file or directory Related

Microsoft (R) Program Maintenance Utility Version 14.00.23026.0 Copyright (C) Microsoft Corporation. mysql1.obj : error LNK2019: unresolved external symbol [email protected] referenced in function _main In fact, there were 4 similar altogether: mysql1.obj : error LNK2019: unresolved external symbol [email protected] referenced in function _main How would you help a snapping turtle cross the road? Upd.

error LNK2019: unresolved external symbol [email protected] referenced in function _win_init_registry Again, in this case, there were several similar unresolved external errors, so let me post them all: mysqlclient.lib(my_init.obj) : error LNK2019: I am trying to install a package that requires node-gyp on Windows 7 x64.         I had Visual Studio 2013. Sobieck00 commented Oct 22, 2015 Thanks for the help.