fatal error call to undefined function printpage House New Mexico

Address 3517 Earlmont Ln, Clovis, NM 88101
Phone (575) 799-1143
Website Link
Hours

fatal error call to undefined function printpage House, New Mexico

Log in or register to post comments Comment #30 October 15, 2014 at 1:56pm Status: Needs review » Needs work The last submitted patch, 22: 1699312-21-element-validation-handler-loading.patch, failed testing. Log in or register to post comments Add child issue, clone issue News itemsDrupal news Planet Drupal Association news Social media directory Security announcements Jobs Our communityCommunity Getting involved Services, Training From the command line as root user, use "service cced.init status". Unfortunately, I need the plurals module; the only temporary solution seems to be to disable (deactivate) the plurals module, modify the date field, then reactivate (re-enable) the plurals module.

Log in or register to post comments Comment #32 pfrenssen CreditAttribution: pfrenssen commented October 22, 2014 at 10:35am Status: Needs review » Reviewed & tested by the community For me this You are probably using a really old version of the module, as I don't see any reason in the above code to define your own print_format_link function. Log in or register to post comments Comment #39 leendertdb CreditAttribution: leendertdb commented February 29, 2016 at 11:24am Status: Needs review » Reviewed & tested by the community We also had Log in or register to post comments Comment #22 gmclelland CreditAttribution: gmclelland commented January 15, 2014 at 11:28pm FileSize 1699312-21-element-validation-handler-loading.patch7.95 KB FAILED: [[SimpleTest]]: [MySQL] 4,286 pass(es), 980 fail(s), and 129 exception(s).

Here's a patch that would solve this by moving the validation handlers next to the form builder stubs. It includes date_admin.inc that has the validation handlers. Not a single line of code is changed, it just moves the validate handler and helper functions into the right file. Log in or register to post comments Comment #4 August 2, 2012 at 9:34am Status: Closed (works as designed) » Needs work The last submitted patch, 1699312-element-validation-handler-loading-3.patch, failed testing.

I've checked latest patch and I was able to apply it without problems. If I redo changes and save, I get the following truncated error: Fatal error: Call to undefined function date_field_widget_settings_form_validate() in .../drupal/includes/form.inc on line 1389 I'm not sure where to start troubleshooting Form builder available <=> validation handlers available. This would be caused by a faulty/non-existant _install function for your module.

I reviewed the patch. View I've tried to resolve this issue today. One example is Field Display Label. URL: http://mail.blueonyx.it/pipermail/blueonyx/attachments/20110517/42d49726/attachment-0002.html Previous message: [BlueOnyx:07314] Re: Fatal error: Call to undefined function printPage() in /usr/sausalito/ui/web/login.php on line 31 Next message: [BlueOnyx:07311] Re: Fatal error: Call to undefined function Messages sorted by:

Join today Download & Extend Drupal Core Distributions Modules Themes Printer, email and PDF versionsIssues Fatal error: Call to undefined function print_settings_default() Closed (fixed)Project:Printer, email and PDF versionsVersion:5.x-4.9Component:CodePriority:NormalCategory:Bug reportAssigned:UnassignedReporter:CLKeenanCreated:December 28, 2009 Log in or register to post comments Comment #18 November 22, 2013 at 8:00pm The last submitted patch, 12: 1699312-12-date_field_validate_fatal.patch, failed testing. Log in or register to post comments Comment #17 November 22, 2013 at 8:00pm Status: Needs review » Needs work The last submitted patch, 12: 1699312-12-date_field_validate_fatal.patch, failed testing. So I'm assuming this bug can have multiple different causes.

There are only 253 lines in this particular code.I have made many races with the builder and they have all worked flawlessly... Log in or register to post comments Comment #34 February 20, 2015 at 11:35pm guidot queued 31: 1699312-29-element-validation-handler-loading.patch for re-testing. Log in or register to post comments Comment #3 Niklas Fiekas CreditAttribution: Niklas Fiekas commented August 2, 2012 at 9:36am FileSize 1699312-element-validation-handler-loading-3.patch8.17 KB FAILED: [[SimpleTest]]: [MySQL] 5,214 pass(es), 4 fail(s), and Title: Re: Fatal error: Call to undefined function mysqli_connect() in...

Log in or register to post comments Comment #13 pounard CreditAttribution: pounard commented May 17, 2013 at 9:57am As a side note, this does not only do a fatal when using Updated the issue summary to include it as an example and the issue title to be more generic. Thanks all! Log in or register to post comments Comment #31 netlooker CreditAttribution: netlooker commented October 15, 2014 at 2:35pm Version: 7.x-2.6 » 7.x-2.x-dev Status: Needs work » Needs review FileSize 1699312-29-element-validation-handler-loading.patch31.69 KB

News itemsDrupal news Planet Drupal Association news Social media directory Security announcements Jobs Our communityCommunity Getting involved Services, Training & Hosting Groups & Meetups DrupalCon Code of conduct DocumentationDocumentation Drupal 8 Not a great solution -- but one that works (for now). Log in or register to post comments Comment #16 mcabalaji CreditAttribution: mcabalaji commented November 22, 2013 at 7:56pm Status: Needs work » Needs review 12: 1699312-12-date_field_validate_fatal.patch queued for re-testing. If CCED is not running, start it with "service cced.init start".

The line in that script is printPage("",$cceDown); So I'd suggest you might want to check to see if CCED is running or not. Log in or register to post comments Comment #26 Katrina B CreditAttribution: Katrina B commented February 12, 2014 at 8:43pm The "Field Label Plurals" module does seem to be the culprit. View #20 1699312-20-date_field_validate_fatal.patch1.17 KBgmclelland FAILED: [[SimpleTest]]: [MySQL] 4,286 pass(es), 980 fail(s), and 129 exception(s). Something I did wrong?Files: CommentFileSizeAuthor #38 date-element_validation_handler-1699312-38.patch2.95 KBazinck 7.x-2.x: PHP 5.3 & MySQL 5.5, D7 43 pass PHP 5.4 & MySQL 5.5, D7 Patch failed to apply PHP 5.5 & MySQL

Field Display Label : #1889544: Date field incompatible? It should return "cced (pid ####) is running...". I'll post an issue, if needed in the Field label plurals module issuse queue as well. and am still getting the same error.

Hope that helps Log in or register to post comments Comment #7 GaëlG CreditAttribution: GaëlG commented September 14, 2012 at 2:04pm Version: 7.x-2.5 » 7.x-2.6 Status: Needs review » Reviewed & Log in or register to post comments Comment #36 Morasta CreditAttribution: Morasta commented August 4, 2015 at 9:22pm This is also a problem with the Required by role module. Log in or register to post comments Comment #5 Niklas Fiekas CreditAttribution: Niklas Fiekas commented August 2, 2012 at 9:36am Status: Needs work » Needs review (Test failures look unrelated.) Log Log in or register to post comments Comment #37 esmitex CreditAttribution: esmitex commented November 23, 2015 at 8:40am I have the same issue: Fatal error: Call to undefined function date_field_widget_settings_form_validate() in

Post by: rskdev on February 02, 2016, 09:49:08 AM I now have:CENTOS 7.2 x86_64mysql 5.6.28PHP 5.5.31Default cPanel settings for PHP and mySQL.Clean install this time - can't even get past:Fatal error: Got the error without. [BlueOnyx:07320] Re: Fatal error: Call to undefined function printPage() in /usr/sausalito/ui/web/login.php on line 31 Chuck Tetlow chuck at tetlow.net Tue May 17 00:22:06 COT 2011 Previous message: [BlueOnyx:07314] Re: Fatal error: Thanks for providing the excellent JoomGallery for free which I am using on a few websites!I have recently updated a website with JoomGallery from Joomla 2.5 to Joomla 3.4.5.JoomGallery was updated

See the log in the details link for more information. I debugged it and found the problem: Date module is lazy loading the validation handlers, even if it shouldn't do it that way. Log in or register to post comments Comment #29 October 15, 2014 at 1:53pm Status: Needs work » Needs review pfrenssen queued 22: 1699312-21-element-validation-handler-loading.patch for re-testing. View Here is an updated working patch (at least for the fatal I got) hope this helps.

When I tried to surf to the main page, back to more fatal errors, about memory this time:Fatal Error: Allowed memory size of 8388608 bytes exhaustedAny assistance would be golden, was Log in or register to post comments Comment #20 gmclelland CreditAttribution: gmclelland commented January 15, 2014 at 4:10pm Status: Needs work » Needs review FileSize 1699312-20-date_field_validate_fatal.patch1.17 KB FAILED: [[SimpleTest]]: [MySQL] 4,286 Log in or register to post comments Add child issue, clone issue Related issues #1889544: Date field incompatible? Thanks Log in or register to post comments Comment #42 May 11, 2016 at 9:34am Status: Fixed » Closed (fixed) Automatically closed - issue fixed for 2 weeks with no activity.

Updating status to RTBC. Log in or register to post comments Comment #10 pounard CreditAttribution: pounard commented May 17, 2013 at 9:45am Status: Needs work » Needs review FileSize 1699312-10-date_field_validate_fatal.patch1.17 KB FAILED: [[SimpleTest]]: [MySQL] 138