gcc make error 255 Waterford Works New Jersey

Address 575 N Route 73 Ste A3, West Berlin, NJ 08091
Phone (856) 767-3596
Website Link http://www.magnumcomputer.com

gcc make error 255 Waterford Works, New Jersey

Remove advertisements Sponsored Links jim mcnamara View Public Profile Find all posts by jim mcnamara « Previous Thread | Next Thread » Thread Tools Show Printable Version Email this Page Subscribe Ah, and if you need do a new test in a Gentoo machine can have my total support. ermannob Joined:2004-01-22 Posts:28 Posted: Tue, 2007-06-05 21:04 Hi, here's the output of make -v Quote: GNU Make 3.81 Copyright (C) 2006 Free Software Foundation, Inc. After this configuration press “q” to go to the previous page then click on “Generate Residential Script”.

Many thanks to lasconic, ChurchOrganist, and ABL. The likely culprit here is that g++ is not on your Path. Join Date: Feb 2004 Last Activity: 16 October 2016, 8:32 PM EDT Location: NM Posts: 10,836 Thanks: 450 Thanked 971 Times in 902 Posts The reason is so that configure will What's the alternative?

M4 is GNU macro processor and it is useful for writing text files which can be logically parsed. You can change this by specifying an alternate Build Directory in the Make Project properties. make -k clean all makefile:12: *** missing separator. make: *** No rule to make target 'all'.

After the generation of the file we need to customize it little bit. In Harry Potter book 7, why didn't the Order flee Britain after Harry turned seventeen? 5008 out of the box Why did my electrician put metal plates wherever the stud is You can remove the -k flag by turning on Project Properties > C/C++ Make Project > Make Builder > Stop on first build error Q6. Modulo % with big number- Infinity error - Javascript Why do train companies require two hours to deliver your ticket to the machine?

Password Home Search Forums Register Forum RulesMan PagesUnix Commands Linux Commands FAQ Members Today's Posts Programming Post questions about C, C++, Java, SQL, and other programming languages here. There are incompatibilities between the new libraries (GCC 4.7) and the old ones (GCC 4.4) used for the compilation of MuseScore 1.3 (and previous versions), so having Qt or MinGW globally Here is the output of the compilation :make[2]: Leaving directory `C:/microchip_solutions_v2013-06-15/USB/CARDIO _ Device - Mass Storage - SD Card reader/Firmware/MPLAB.X'c:\program files (x86)\microchip\xc32\v1.33\bin\bin\gcc\pic32mx\4.5.2\..\..\..\..\bin/xc32-ld.exe:--defsym:3: syntax errormake[1]: Leaving directory `C:/microchip_solutions_v2013-06-15/USB/CARDIO _ Device - Mass Can't debug with MPLAB X, keep getting "An Error occured while running" Using hid_basic with Harmony 1.08.01 Bootloader Saving IP settings to Flash under Harmony...

I originally tried keeping the "Qt32-4.8.4" naming convention, but I guess it caused an inconsistency somewhere. make -k clean all make: *** [clean] Error 255 rm -f Test1.o Test2.o Main.o test_me.exe g++ -g -o Test1.o -c Test1.cpp make: *** [Test1.o] Error 255 make: *** [Test2.o] Error 255 Not the answer you're looking for? I am trying to compile proftpd on a vanilla Solaris 10 server and I am getting an error when I try to 'make' Server - Solaris 10 update 4 Installed packages

What does that mean? Browse other questions tagged gcc makefile g++ or ask your own question. So I would do
mingw32-make -f Makefile.mingw clean
mingw32-make -f Makefile.mingw debug
mingw32-make -f Makefile.mingw install
You probably have a lot of spurious directories in your ermannob Joined:2004-01-22 Posts:28 Posted: Wed, 2007-06-06 17:41 I tried by myself...

Or are you launching mscore from the build.debug directory? Example: Generating residential script (“Generate OpenSIPS Script” -> “Residential Script” -> “Configure Residential Script”) so we come to this page: Here we can configure how OpenSIPs will work. The standard syntax of Makefiles dictates that every line in a build rule must be preceded by a Tab character. In my case, it will be installed in “/usr/local/opensips_1_11/”.

Makefile:101: recipe for target 'install' failed mingw32-make: *** [install] Error 1 -------------------------------------------------------- Also, prior to this instruction, I arrived at this similar error: -------------------------------------------------------- C:\Sites\MuseScore>mingw32-make SHELL=cmd.exe -f Makefile debug install if C:\Sites\MuseScore>mingw32-make -f Makefile.mingw install cd build.release & mingw32-make install The system cannot find the path specified. However, there's still a few issues. For security, set root password as following:   mysql> set password for [email protected]=password(‘fedoracore2'); Generate OpenSIPS Configuration File The prerequisite is to install m4 package which comes by default with most Linux

However, when I run mscore.exe, I get a strange gray version of the software with no sound. When I try to do that though, I'm getting the following: ...................................................................... I'm trying to find these errors on my own, but I'm only a second year CS student and my understanding is minimal. Example: # opensipsctl fifo debug 1  OpenSIPS project is growing quickly so please always read in the latest documentation.

This program built for i686-pc-linux-gnu The change of G2DATA seems work, but I keep getting the error "make: *** [messages.po] Error 255" when I make "make es.po" or "make install PO=es". editing? Generate OpenSIPS script Exit and save all changes. However, it's hung up again on: mingw32-make[3]: Entering directory 'C:/Sites/MuseScore/build.debug' Scanning dependencies of target portmidi mingw32-make[3]: Leaving directory 'C:/Sites/MuseScore/build.debug' all.h:32:17: fatal error: QtGui: No such file or directory compilation terminated.

I would like to know cj> what an "Error 255" is. lots of things ommitted ..--defsym=_SUPPRESS_PLIB_WARNINGI think you are trying to suppress the warnings from the plib going away by adding --defsym=_SUPPRESS_PLIB_WARNING to the linker options as shown in picture one.Attachments are Note: press q letter or left-arrow to go back to the previous screen. Trunking scripts: where we have PBXs and SIP trunks and we want to route the traffic.

In the first case (which I suggest), a folder "win32install" is created inside MuseScore folder and all necessary executables, dlls, soundfonts, icon files are moved to the proper folder, and you This file contains the configuration of the database connection. # vim opensipsctlrc. Sorry! JACK is not necessary for MuseScore to run.

Some projects, known as Standard Make projects, allow you to define your own makefile. All rights reserved. Note that I modified GNUmakefile writing the path of G2DATA. OpenSIPS Installation Here i will install OpenSIPS 1.11.

Ordinary version is 1.3? What actually are virtual particles? I just need to know where I can find a cj> list of all the make error codes. My Console view looks like: mingw32-make clean all process_begin: CreateProcess((null), rm -f Test1.o Test2.o Main.o test_me.exe, ...) failed.

Please login or register.Did you miss your activation email? 1 Hour 1 Day 1 Week 1 Month Forever Login with username, password and session length News: Home Help Search Login I'd removing executing the program from your Makefile, and running it directly - then it's easier to see what's going on. –Douglas Leeder Apr 10 '12 at 10:43 add a comment| If you need git for the "make revision" command, you can add C:/Program Files (x86)/git/cmd ("cmd", not "bin"!) to the PATH. My Console view says Error launching builder.

Here is one possibility (commented out)... # %.dep : %.cpp # g++ -M $(FLAGS) $< > [email protected] # include $(OBJS:.o=.dep) Frequently Asked Questions: Your Console view can be very useful for CPPS := $(shell ls src/*cpp) TEMP := $(subst src/,obj/,$(CPPS)) OBJS := $(subst .cpp,.o,$(TEMP)) HEADERS := $(shell ls inc/*.h) EXEC := bin/testfile all: $(EXEC) $(EXEC) : $(OBJS) $(HEADERS) g++ -I inc/ $(OBJS) The CDT can generate a makefile for you, such projects are called Managed Make projects. In Harry Potter book 7, why didn't the Order flee Britain after Harry turned seventeen?

This Tab character is often accidentally replaced with spaces, and because both result in white-space indentation, this problem is easily overlooked.