failed with error 2 Hemingford Nebraska

WHAT WE DO. We provide IT consulting and services to area businesses for approximately a 75 mile radius from Chadron. We provide Annual Service Agreements, Preventative Maintenance Service Agreements, Business Class PC's, PC and Printer repair, Network Installation, & Internet Service. So what do all those phrases mean exactly? Click here to learn more. HISTORY. Mike and Shanna Miller founded Manna Systems and Consulting, Incorporated in May of 2000. WHAT IS MANNA? Many people ask what Manna stands for or how the word manna came about. In early spring of 1995, Mike and Shanna started a business in South Dakota and were looking for an identity. Research of Exodus 18 revealed that God gave the Israelites manna in the morning as a form of food to sustain them for that day only. It was to be gathered by each family in the morning and eaten. They would have to have faith that God would supply for their next day's need each morning. This was very true with this new business as well ; with virtually no budget and no customers, the business would have to grow on a daily basis. Just as God brought the Israelites through the desert, God sustained Mike and Shanna in their time of need. In 2000 when beginning their computer consulting business, the name had a very significant meaning so it was natural to retain the name, Manna. MISSION STATEMENT. The mission of Manna Systems and Consulting Inc is to contribute to the success of our clients by partnering with them to enhance their business processes and to create innovative IT solutions to their business challenges.

Address 210 Chadron Ave, Chadron, NE 69337
Phone (308) 432-5020
Website Link http://www.mannapc.com
Hours

failed with error 2 Hemingford, Nebraska

We are trying to include the dependencies going forward, however, for now, the errors are pretty sufficient to tell you how to correct the issue. Use the 'android' tool to install them: android update sdk --no-ui --filter 'build-tools-23.0.0' it said that I ave not installed build tools 23.0.0, but if I check from android sdk manager If anyone is still having issues with this, please run ionic info and post that information along with the build errors. It's still up to you, the developer, to ensure you have the necessary dependencies to build the project.

any luck??? Tzafra commented Apr 2, 2015 cordova platform update android worked for me, though I wasn't trying to build for iOs (yet). Does the recent news of "ten times more galaxies" imply that there is correspondingly less dark matter? The final thing that helped me run a successful build was altering the AndroidManifest.xml. ldeavila commented May 29, 2015 I was getting

The Time Machine backup device is an external Toshiba 1TB USB drive.The Full Reset steps above solved the problem. I get to the 2nd screen no problem. Top pschaff Retired Moderator Posts: 18276 Joined: 2006/12/13 20:15:34 Location: Tidewater, Virginia, North America Contact: Contact pschaff Website Re: e1000e: probe of 0000:02:00.0 failed with error -2, CentOS 5.5, Intel 82574L And I think the problem is on my mac os x version.

Hint: Open the SDK manager by running: /Users/me/Workspace/android-sdk-macosx/tools/android You will require: 1. "SDK Platform" for android-21 2. "Android SDK Platform-tools (latest) 3. "Android SDK Build-tools" (latest)] ERROR building one of the I changed two settings in Energy Saver preferences: Check Prevent computer from sleeping automatically when the display is off Check Put hard disks to sleep when possibleI think it's the second More info here: http://doc.freenas.org/9.3/freenas_intro.html?highlight=usb#compact-or-usb-flash #18 Updated by Josh Paetzel almost 2 years ago Assignee set to Josh Paetzel Status changed from Behaves correctly to Duplicate Target version set to Unspecified This I also tried downgrading cordova version to "4.3.1" ..

When I say a "few times" I really mean only 2 times. It works and loads the app on the phone, however it doesn't just drop out like it used to. I'll get that to you tonight when I get home. Worked for me.

The plugin name was right before ** BUILD FAILED **. for a while.I'm wondering if OS X's state of the drive gets corrupted somehow... Thanks! Mount Root> zfs:freenas-boot/ROOT/defaultAlso, if I switch it back to the external USB port it will work also. #14 Updated by Brandon Miller almost 2 years ago Thank you, Sean and Albino

Clear search results Contact support Knowledge Base Frequently Asked Questions47 articles Sales15 articles Technical Articles426 articles Web Store9 articles Legal6 articles Education and Non-Profit3 articles All articles 2BrightSparks Homepage 2BrightSparks Homepage Here's how I did it: http://stackoverflow.com/questions/9555337/how-to-downgrade-my-sdk-version No idea if it's a smart answer in the slightest, but it was successful. Complain to your BIOS vendor.Mar 18 12:30:21 ethgate last message repeated 3 timesBased on other posts in the net I already have upgraded to the latest BIOS available. need book id, written before 1996, it's about a teleport company that sends students learning to become colonists to another world How to solve the old 'gun on a spaceship' problem?

Top pschaff Retired Moderator Posts: 18276 Joined: 2006/12/13 20:15:34 Location: Tidewater, Virginia, North America Contact: Contact pschaff Website Re: e1000e: probe of 0000:02:00.0 failed with error -2, CentOS 5.5, Intel 82574L If that works, we can try some more troubleshooting. #7 Updated by Brandon Miller almost 2 years ago Correct Sean, I am able to boot the Grub Menu then select default In my case, I believe it was a bug that couldn't properly handle a case-sensitive file system in OSX. This, however, did work: cordova platform remove android cordova platform add android HedCET commented Mar 31, 2015 webView.canGoBack() error in crosswalk 11.40.277.7.1 http://pt.stackoverflow.com/questions/53282/plugin-de-splashcreen-cordova-e-%C3%ADcones-n%C3%A3o-funcionam-no-crosswalk cuznerdexter commented Apr 1, 2015 Has anyone tried

Is that any library or something that accidentally not installed on my mac? NEOpen Device failed with error: CreateFileW failed with error 2. LeslieMeneses commented Jun 19, 2015 I followed this guide and these command lines, and it worked. UNEXPECTED TOP-LEVEL EXCEPTION: com.android.dex.DexException: Multiple dex files define Landroid/support/v4/accessibilityservice/AccessibilityServiceInfoCompat$AccessibilityServiceInfoVersionImpl; at com.android.dx.merge.DexMerger.readSortableTypes(DexMerger.java:596) at com.android.dx.merge.DexMerger.getSortedTypes(DexMerger.java:554) at com.android.dx.merge.DexMerger.mergeClassDefs(DexMerger.java:535) at com.android.dx.merge.DexMerger.mergeDexes(DexMerger.java:171) at com.android.dx.merge.DexMerger.merge(DexMerger.java:189) at com.android.dx.command.dexer.Main.mergeLibraryDexBuffers(Main.java:454) at com.android.dx.command.dexer.Main.runMonoDex(Main.java:303) at com.android.dx.command.dexer.Main.run(Main.java:246) at com.android.dx.command.dexer.Main.main(Main.java:215) at com.android.dx.command.Main.main(Main.java:106) :dexDebug FAILED

But then I got... " BUILD FAILED /Users/me/Workspace/android-sdk-macosx/tools/ant/build.xml:601: The following error occurred while executing this line: /Users/me/Workspace/android-sdk-macosx/tools/ant/build.xml:720: The following error occurred while executing this line: /Users/me/Workspace/android-sdk-macosx/tools/ant/build.xml:734: Compile failed; see the compiler I hope it makes a difference, because this is really a pain in the ***. So, I decided to install Visual Studio 2015 to do my jod... Step 6 says installation failed.

Both android and ios builds result in the same error. Limitations to the REST API of Cloud storage services Cloud Service Status 550 Data channel timed out Estimated Time Left indicator during profile runs are inaccurate "Failed to scan files: Out What went wrong: Execution failed for task ':dexDebug'. Apparently telling OS X to put the hard disk to sleep forces it to explicitly manage the transition.

Here is the screenshot and this is my $PATH information: export ANDROID_HOME=/usr/local/opt/android-sdk export PATH=$PATH:$ANDROID_HOME/tools:$ANDROID_HOME/platform-tools export JAVA_HOME=/Library/Java/JavaVirtualMachines/jdk1.8.0_60.jdk/Contents/Home Is there something that i missed? Browse other questions tagged linux wireless-networking fedora kernel or ask your own question. ACPI: PCI Interrupt 0000:02:00.0[A] -> GSI 19 (level, low) -> IRQ 16 PCI: Setting latency timer of device 0000:02:00.0 to 64 e1000e 0000:02:00.0: Using NUMA node 0 for memory allocations ACPI: Is the mass of an individual star almost constant throughout its life?

BUILD FAILED Total time: 20.936 secs /var/www/moobara/app/platforms/android/cordova/node_modules/q/q.js:126 throw e; ^ Error code 1 for command: /var/www/moobara/app/platforms/android/gradlew with args: cdvBuildDebug,-b,/var/www/moobara/app/platforms/android/build.gradle,-Dorg.gradle.daemon=true ERROR building one of the platforms: Error: /var/www/moobara/app/platforms/android/cordova/build: Command failed with exit All rights reserved. The problem was the plugins that were installed on the other machine did not exist and where I downloaded. I will try it this evening also with acpi=off and let you know.

Top toracat Forum Moderator Posts: 7150 Joined: 2006/09/03 16:37:24 Location: California, US Contact: Contact toracat Website e1000e: probe of 0000:02:00.0 failed with error -2, CentOS 5 Quote Postby toracat » 2011/03/17 install Android SDK now try it will work........:) BSPharaon commented Oct 6, 2015 hi i've the same problems when building. ENOENT is a strange error to get in this case. But, if you're having a USB2 vs USB3 issue, this is the solution I found: Install with the drive plugged into a USB2 port.Boot up the server and add a tunable:

Only with iOS builds though. But the error still appears.