fatal error c1083 cannot open windows.h Holts Summit Missouri

Security Products Security Systems

Address 1600 Southwest Blvd, Suite 2, Jefferson City, MO 65109
Phone (573) 635-2280
Website Link http://procommsecurity.com
Hours

fatal error c1083 cannot open windows.h Holts Summit, Missouri

Exploded Suffixes The mortgage company is trying to force us to make repairs after an insurance claim What is the most expensive item I could buy with £50? How do I help minimize interruptions during group meetings as a student? Epic, Epic Games, Unreal, Unreal Engine, UE4, and their logos are trademarks or registered trademarks of Epic Games, Inc. in the United States of America and elsewhere.

it dint work ...i dont know wats .dll and how u change it . Reply With Quote Quick Navigation Visual C++ Programming Top Site Areas Settings Private Messages Subscriptions Who's Online Search Forums Forums Home Forums Visual C++ & C++ Programming Visual C++ Programming Visual What is a type system? That's all for now.

C:\..\mysql.h(374) : error C2143: syntax error : missing ')' before '*' C:\..\mysql.h(374) : error C2143: syntax error : missing '{' before '*' C:\..\mysql.h(374) : error C2059: syntax error : ')' C:\..\mysql.h(375) more stack exchange communities company blog Stack Exchange Inbox Reputation and Badges sign up log in tour help Tour Start here for a quick overview of the site Help Center Detailed IDI_APP ICON "app.ico" ///////////////////////////////////////////////////////////////////////////// // // Dialog // IDD_APP DIALOGEX 0, 0, 512, 424 STYLE DS_SETFONT | DS_FIXEDSYS | WS_MINIMIZEBOX | WS_CLIPCHILDREN | WS_CAPTION | WS_SYSMENU EXSTYLE WS_EX_CONTROLPARENT | WS_EX_APPWINDOW CAPTION Join them; it only takes a minute: Sign up Fatal Error C1083 - Cannot open include file: “windows.h”: No such file or directory up vote 3 down vote favorite 1 Hey

I have ensured Step 3 of the installation instructions (http://msdn2.microsoft.com/en-us/express/aa700755.aspx) was followed as regularly suggested on various forums, as well as Step 4 though I'm unsure whether I need to worry Browse other questions tagged visual-c++ path environment scons include or ask your own question. Sorry I haven't tried Express versions so I don't know if they create additional Start menu shortcuts like Pro and above do. This does not make sense to me, but I will keep my hopes up that maybee one of you can give feed back on what this error might mean.

Logical fallacy: X is bad, Y is worse, thus X is not bad Are independent variables really independent? mysql1.obj : error LNK2019: unresolved external symbol [email protected] referenced in function _main In fact, there were 4 similar altogether: mysql1.obj : error LNK2019: unresolved external symbol [email protected] referenced in function _main mysqlclient.lib(random.obj) : error LNK2019: unresolved external symbol [email protected] referenced in function ... Books for chess traps What kind of bicycle clamps are these?

In short you need to get the things that vsvars32.bat configures into the scons configuration somehow. You should see: $(WindowsSdkDir)\include If this is missing, you found a problem. Then all the problems were gone, except for one: Error 5 error RC1015: cannot open include file 'windows.h'. Reply With Quote March 18th, 2008,07:24 PM #3 stubaan View Profile View Forum Posts Junior Member Join Date Nov 2007 Location Gainesville, FL Posts 9 Re: Persistent "Cannot open include file:

All rights reserved. Any better way to determine source of light by analyzing the electromagnectic spectrum of the light House of Santa Claus What are "desires of the flesh"? What am I missing? How to handle a senior developer diva who seems unaware that his skills are obsolete?

TCWilliamson Apr 21 '14 at 08:33 PM Ah, i have found the Lib and Include, just gonna try them now, thanks. Does anyone have scons experience? So I need to use a 32-bit header (and different include path), which I downloaded and extracted. Those are the instructions I followed.

EDIT Actually (and I forgot to tell you this) I started the command prompt with the link "Visual Studio 2005 Command Prompt". So I installed (Or re-installed, I'm not sure) the Windows SDK, and added the include dir of the SDK to the include "path" of the project. more stack exchange communities company blog Stack Exchange Inbox Reputation and Badges sign up log in tour help Tour Start here for a quick overview of the site Help Center Detailed Please help!!!

Look at the instructions at http://msdn.microsoft.com/vstudio/express/visualc/usingpsdk/ and specifically step 3 to set the include path. So I started of with the Color Basics example, and I can not get it to compile. Thanks, Ayman Shoukry VC++ Team Wednesday, July 26, 2006 8:49 PM 0 Sign in to vote Sorry about that. If it did not exist you created the "Include" environment variable and set the value to that specified in your answer? –JohnDoe Dec 11 '14 at 12:40 1 I'm genuinely

The code I am trying to compile was originally written for Unix, and we now HAVE to get it compiling on Windows. bkircher commented Sep 29, 2015 Following include paths are set in a standard Visual Studio 2015 project that targets Windows 8.1: curl member captain-caveman2k commented Sep 30, 2015 Hi Ben, Cheers it said my link all the way to My Documents >>>"...\My Documents\vspfix\PSDK-amd64.exe is not valid Win32 application." with only the option of pressing "OK". Help pls? 1 commentshareall 1 commentssorted by: besttopnewcontroversialoldrandomq&alive (beta)[–]lejugg[S] 0 points1 point2 points 2 years ago(0 children)The guys over at unrealengine forums fixed this for me within 20 minutes!!

Examples cat dog --matches anything with cat,dog or both cat +dog --searches for cat +dog where dog is a mandatory term cat -dog -- searches for cat excluding any result containing I'm using the VS2015 x64 Native Tools Command Prompt. Why are empty blocks not all the same size? Basically: cmd.exe /k ""C:\Program Files (x86)\Microsoft Visual Studio 14.0\VC\vcvarsall.bat"" amd64 What are the values of environment variables INCLUDE, LIB, LIBPATH?

BUILD FAILED C:\ikvm-0.36.0.11\native\native.build(17,10): External Program Failed: cl (return code was 2) I have the Platform SDK installed. I should have given the full path, but it was very obvious to me! When I try to run the example code for 3rd person, these errors appear: 1>------ Build started: Project: MyProject, Configuration: DebugGame_Editor x64 ------ 1> Performing 8 actions (max 4 parallel jobs) Thursday, July 27, 2006 12:05 PM 0 Sign in to vote Looks like you skipped step #3 in the installation instructions...

The fundamental problem is that scons does not handle recent versions of SDKs/VS . Of course not! :-) I'll give it a shot tomorrow. At the command line this is typically done using a batch file that Visual Studio installs called vsvars32.bat (or vcvars32.bat for compatibility with VC6). Well : This is the complete include setting of the IDE: C:\Program Files\Microsoft Platform SDK for Windows Server 2003 R2\IncludeC:\Program Files\Microsoft DirectX SDK (June 2006)\IncludeC:\Program Files\Microsoft DirectX 9.0 SDK (October 2005)\Include$(VCInstallDir)include$(VCInstallDir)PlatformSDK\include\prerelease$(VCInstallDir)PlatformSDK\include$(FrameworkSDKDir)include

My Build Output: 1>------ Build started: Project: MyProject2, Configuration: Development_Editor x64 ------ 1> Parsing headers for MyProject2Editor 1> Code generation finished for MyProject2Editor and took 17.384 1> rc.exe MyProject2.rc 1> PCH.MyProject2.MyProject2.h.cpp You may have to register or Login before you can post: click the register link above to proceed. Tuesday, July 25, 2006 7:29 PM Answers 0 Sign in to vote The instructions on downloading and installing the Platform SDK are specifically written to let you use windows.h.  You messed To start viewing messages, select the forum that you want to visit from the selection below.

add new comment (comments are locked) 10|2000 characters needed characters left ▼ Everyone Moderators Original poster and moderators Other... bkircher commented Sep 29, 2015 Same thing with x86 command line. You won't be able to vote or comment. 012Problem "cannot open include windows.h" - no help found anywhere... (self.unrealengine)submitted 2 years ago by lejuggHey, I subscribed to ue4 today, downloaded vs2013 ( by now I current community chat Stack Overflow Meta Stack Overflow your communities Sign up or log in to customize your list.

All rights reserved. /out:libmysql.exe "C:\Program Files (x86)\MySQL\mysql-5.5.30-win32\lib\libmysql.dll" mysql1.obj C:\Program Files (x86)\MySQL\mysql-5.5.30-win32\lib\libmysql.dll : fatal error LNK1107: invalid or corrupt file: cannot read at 0x368 The problem is trying to use the .dll share|improve this answer answered Oct 17 '08 at 4:56 Michael Burr 240k31353574 I can confirm that this is the process that our team normally use when working with SCons How much interest should I pay on a loan from a friend? If you open a suitable command prompt with its environment variables already set then you can compile on the command line.