gcc internal compiler error killed program cc1plus Walnut Mississippi

Address 102 N Cass St Ste C, Corinth, MS 38834
Phone (662) 554-4263
Website Link
Hours

gcc internal compiler error killed program cc1plus Walnut, Mississippi

Did you already have gcc 4.8 installed on your system before attempting to install NuPIC? https://travis-ci.org/KayEss/fost-base-dev/jobs/18963298 https://travis-ci.org/KayEss/fost-hello/jobs/18921192 https://travis-ci.org/KayEss/fost-hello/jobs/18921192 As you can see between the second two and the first, I tried to remove a diagnostic suppression that gcc wasn't understanding, but that had no effect. Another big SWIG generated source file algorithms_wrap.cxx 3060 KiB size -- compiled ok. The fix was to do the following:Code:freedd if=/dev/zero of=/var/swap.img bs=1024k count=1000mkswap /var/swap.imgswapon /var/swap.imgfreemake -f makefile.unixRegardless of what the first poster said.

See file:///usr/share/doc/gcc-4.7/README.Bugs for instructions. (btw this mean send full bug report to gcc folks, not to tc) ghost commented Jul 15, 2013 grahamracklot, you have some incopatible packages in your distro. But gcc doesn't say so. You signed out in another tab or window. Terms Privacy Security Status Help You can't perform that action at this time.

Make sure you're only compiling one file at a time. Setting up build-essential (11.5ubuntu3) ... Out of memory: Kill process 23747 (cc1plus) score 15 or sacrifice child Killed process 23747, UID 2243, (cc1plus) total-vm:214456kB, anon-rss:178936kB, file-rss:5908kB Most likely that is your problem. Advertise here. 1476671182 Hero Member Offline Posts: 1476671182 Ignore 1476671182 1476671182 #2 1476671182 Report to moderator 1476671182 Hero Member Offline Posts: 1476671182 Ignore 1476671182 1476671182 #2 1476671182 Report to moderator 1476671182

Terms Privacy Security Status Help You can't perform that action at this time. Setting up unzip (6.0-7ubuntu1) ... Esto es software libre; vea el código para las condiciones de copia. Description SebastiansPublicAddress 2013-08-14 20:54:08 UTC I'm compiling on a raspberry pi (no cross compiling), so this may be caused by insufficient memory.

Maybe it'd be worth installing gcc 4.8 on our current systems for the time being? The code is quite template heavy in places. Already have an account? What's behind the word "size issues"?

Setting up wget (1.13.4-3ubuntu1) ... We recommend upgrading to the latest Safari, Google Chrome, or Firefox. but did the job. 512MB ram was not enough, my swapfile was 4GB (more than enough I guess). Sign up for free to join this conversation on GitHub. Powered by SMF 1.1.19 | SMF © 2006-2009, Simple Machines Loading...

What (combination of) licenses is popular for public/shared proprietary software (“Feel free to contribute, but only we can make commercial use”)? Can you explain in detail? mv -f log/.deps/liblog_la-log.Tpo log/.deps/liblog_la-log.Plo mv -f slave/containerizer/.deps/libmesos_no_3rdparty_la-docker.Tpo slave/containerizer/.deps/libmesos_no_3rdparty_la-docker.Plo mv -f log/.deps/liblog_la-consensus.Tpo log/.deps/liblog_la-consensus.Plo mv -f slave/containerizer/.deps/libmesos_no_3rdparty_la-external_containerizer.Tpo slave/containerizer/.deps/libmesos_no_3rdparty_la-external_containerizer.Plo mv -f log/.deps/liblog_la-coordinator.Tpo log/.deps/liblog_la-coordinator.Plo mv -f slave/.deps/libmesos_no_3rdparty_la-slave.Tpo slave/.deps/libmesos_no_3rdparty_la-slave.Plo mv -f master/.deps/libmesos_no_3rdparty_la-master.Tpo master/.deps/libmesos_no_3rdparty_la-master.Plo make[2]: Leaving directory Comment 4 bryan 2012-09-24 00:32:10 UTC (In reply to comment #1) > You appearantly ran out of memory and the kernel decided to kill cc1.

I am an employee of Ripple.1Joe1Katzci1rFcsr9HH7SLuHVnDy2aihZ BM-NBM3FRExVJSJJamV9ccgyWvQfratUHgN vual Hero Member Offline Activity: 658 Re: g++: internal compiler error: Killed (program cc1plus) September 29, 2013, 06:01:53 AM #4 I tried adding a TrinityCore member Aokromes commented Jul 15, 2013 Linking CXX executable worldserver [100%] Built target worldserver real 26m16.420s user 22m6.127s sys 3m14.860s [[email protected] bin434]$ gcc --version gcc (GCC) 4.8.1 20130603 (Red Hat make[2]: *** [src/server/game/CMakeFiles/game.dir/Entities/Player/Player.cpp.o] Error 4 make[1]: *** [src/server/game/CMakeFiles/game.dir/all] Error 2 make: *** [all] Error 2 Ubuntu 12.04 LTS My 2 cents to help the community in any way I can, hope Join them; it only takes a minute: Sign up make -j 8 g++: internal compiler error: Killed (program cc1plus) up vote 2 down vote favorite 1 When I deploy Apache Mesos

Browse other questions tagged linux ubuntu gcc g++ mesos or ask your own question. KayEss commented Feb 19, 2014 I did another test across the whole library: Command being timed: "../bjam -a toolset=gcc" User time (seconds): 161.29 System time (seconds): 10.86 Percent of CPU this We recommend upgrading to the latest Safari, Google Chrome, or Firefox. Does that mean gcc builds aren't going to be an option on travis?

Already have an account? Swap will overcome this problem. Already have an account? Already have an account?

Error still persists, here is some additional info regarding my installed packages/versions, hope this helps! Target: x86_64-redhat-linux Configured with: ../configure --prefix=/usr --mandir=/usr/share/man --infodir=/usr/share/info --with-bugurl=http://bugzilla.redhat.com/bugzilla --enable-bootstrap --enable-shared --enable-threads=posix --enable-checking=release --with-system-zlib --enable-__cxa_atexit --disable-libunwind-exceptions --enable-gnu-unique-object --enable-languages=c,c++,objc,obj-c++,java,fortran,ada --enable-java-awt=gtk --disable-dssi --with-java-home=/usr/lib/jvm/java-1.5.0-gcj-1.5.0.0/jre --enable-libgcj-multifile --enable-java-maintainer-mode --with-ecj-jar=/usr/share/java/eclipse-ecj.jar --disable-libjava-multilib --with-ppl --with-cloog --with-tune=generic --with-arch_32=i686 --build=x86_64-redhat-linux Thread Skip to content Ignore Learn more Please note that GitHub no longer supports old versions of Firefox. Bug1091210 - gcc: Internal error: Killed (program cc1plus) Summary: gcc: Internal error: Killed (program cc1plus) Status: CLOSED NOTABUG Aliases: None Product: Red Hat Enterprise Linux 6 Classification: Red Hat Component: gcc

The fix was to do the following:Code:freedd if=/dev/zero of=/var/swap.img bs=1024k count=1000mkswap /var/swap.imgswapon /var/swap.imgfreemake -f makefile.unixRegardless of what the first poster said. Travis CI member roidrage commented Feb 17, 2014 It could very well be a memory issue. share|improve this answer answered Jan 26 at 10:42 Jon Combe 12612 You saved my life :) –taiar Oct 13 at 3:44 add a comment| Your Answer draft saved make: *** [CQuickFixProxy.o] Error 1 I have tried again and it seems to be ctrying to compile this source file for quite a long time.

Setting up zip (3.0-6) ... Actual results: gcc error Expected results: gcc compile successfully Additional info: I have the same source codes and compiled successfully in your RHEL 5.* releases Anything else required for heloing your If you would like to support Casinocoin development, please consider contributing BTC to : 1NGvxkdQra41xcy7JWnucnLg7nV169p8jsThese funds will be used to pay for external development.Personal CSC addresses: CbPcvneUmRuQc9k651ezm7hjK89PRGyLsE & CMUMq6WNpk1EjoMoiVuETRcEwxKAGJstZT garthkiser Full I also hope that it is nothing related to gcc compiler.

Personal Open source Business Explore Sign up Sign in Pricing Blog Support Search GitHub This repository Watch 192 Star 4,979 Fork 448 travis-ci/travis-ci Code Issues 1,119 Pull requests 0 Projects Swap will overcome this problem.Goldseal deserves some tips. I got the RAM upgraded to 2GB, and it actually compiled Player.cpp Thanks for all the help guys, and xenogears for the tip! Already have an account?

Why does argv include the program name?