fatal error lnk1181 lib Kewadin Michigan

Address 735 E Cayuga St, Bellaire, MI 49615
Phone (231) 350-7271
Website Link
Hours

fatal error lnk1181 lib Kewadin, Michigan

share|improve this answer answered Jun 4 at 22:15 Pierre 1,1671119 add a comment| up vote -1 down vote I created a bin directory at the project_dir level, then created a release/debug share|improve this answer edited Apr 14 at 8:10 Matt♦ 49.6k1093140 answered Aug 19 '13 at 17:11 Ravi Sohal 1 add a comment| Your Answer draft saved draft discarded Sign up I have opened in Visual Studio the project file, which failed to compile and: "Project Properties -> VC++ Directories -> Library Directories" should point to C:\Program Files\Microsoft SDKs\Windows\v7.1\Lib\x64 gyandeeps commented Mar Install the VSIX on your machine.

The fix is either 1) put the lib reference in "quotes", or 2) add the lib's path to your Library Directories (Configuration Properties >> VC++ Directories). What seems to be happening is Foo(lib) is built first--which is proper because Foo(exe) is marked as depending on Foo(lib). Don't use any quotations. Join today Support Terms of Use *Trademarks Privacy Cookies Publications Intel® Developer Zone Newsletter Intel® Parallel Universe Magazine Look for us on: FacebookTwitterGoogle+LinkedInYouTube English简体中文EspañolPortuguês Rate Us Skip to content Ignore

This also explains why a subsequent 'build' works--that doesn't delete output files. To get the 8.3 form, do (at the command line): DIR /AD /X recursively through every level of the directories. Join them; it only takes a minute: Sign up Visual Studio: LINK : fatal error LNK1181: cannot open input file up vote 51 down vote favorite 7 I've been encountering a I start a new IVF Project (static Lbrary) In VS2013, I add a new  win32 console application to the IVF Project I set the fortran function dependent to the main cpp Please see

Then I tried to package the game again but got this error. Always getting mentioned error on Rebuild. share|improve this answer answered Jun 25 '12 at 2:19 Chris Thorne 37935 add a comment| up vote 9 down vote I can see only 1 things happening here: You did't set add new comment (comments are locked) 10|2000 characters needed characters left ▼ Everyone Moderators Original poster and moderators Other...

How did you solve it? Tags vcc compiler Products MATLAB Compiler Related Content 3 Answers Renish Ramegowda (view profile) 4 questions 2 answers 1 accepted answer Reputation: 2 Vote1 Link Direct link to this answer: https://www.mathworks.com/matlabcentral/answers/62285#answer_82657 An Error Occurred Unable to complete the action because of changes made to the page. And the library directory had the correct path set.

Here is the response I get when I perform both of these commands: C:\~projects\needle\scripts\testing>node-gyp configure gyp info it worked if it ends with ok gyp info using [email protected] gyp info using The solution to this situation is to enclose the long file name (path plus file name) in quotation marks.For more information, see .lib Files as Linker Input.See Also/LIBPATH (Additional Libpath) Show: Haven't had any problems since. This is how I do it: @ #if defined(QT_SHARED) || defined(QT_PLUGIN) #define MYPROJECT_EXPORT Q_DECL_EXPORT #endif class MYPROJECT_EXPORT ClassExample : public QObject { } @ The thing that I can't understand is

United States Patents Trademarks Privacy Policy Preventing Piracy Terms of Use © 1994-2016 The MathWorks, Inc. Thank you @bnoordhuis for all your help. The system cannot find the file specified. I also have the experimental webbrowser plugin enabled in my game.

Node.js Foundation member bnoordhuis commented Mar 31, 2016 Can you post the exact contents of your binding.gyp? Separate the words with plus signs (cat +dog) to search for items that may contain cat but must contain dog. You’ll be auto redirected in 1 second. current community chat Stack Overflow Meta Stack Overflow your communities Sign up or log in to customize your list.

Epic, Epic Games, Unreal, Unreal Engine, UE4, and their logos are trademarks or registered trademarks of Epic Games, Inc. Viewable by all users 0 This is a partial answer, more details in the thread above. You open an Intel Fortran command window (from the Start Menu or a suitable shortcut), and type the commands there. Unfortunately I don't have a solution to the problem as it involves Rebuild.

add new comment (comments are locked) 10|2000 characters needed characters left ▼ Everyone Moderators Original poster and moderators Other... Steve - Intel Developer Support Top mecej4 Thu, 08/13/2015 - 08:45 Quote:Zang Lee wrote: I can't find the VC++-Directories from Tools->Options->Projects and Solutions ..it is outdated. I've looked around online and haven't found anything useful. nickzuber commented Apr 2, 2016 So I booted up VS15 and downloaded some C++ SDK and now everything works perfectly!

Terms Privacy Security Status Help You can't perform that action at this time. With the 4.10 release you need a working Visual Studio 2015 install (as mentioned in the release notes - from the launcher we only support 2015, as supporting both would bloat Log log.txt (428.6 kB) Dan.OConnor STAFF Dec 03 '15 at 11:57 PM The issue appears to be that in the case of MinigameMadness, the project is no longer blueprint only. Apply Today MATLAB Academy New to MATLAB?

NoScript). Any suggestions? I have tried cleaning the solution, but that doesn't always work. A bug in VS I guess.

This is a temporary solution. These can be combined with each other. Thanks. You can created a static library using a dynamic Qt.

This documentation is archived and is not being maintained. What are Imperial officers wearing here? Next time you run the >> mex -setup command, the error reappears :)Now you can repeat the above steps once again to get rid of the issue 1 Comment Show all Read more on this here share|improve this answer answered Sep 29 '13 at 10:50 alexkr 3,59111520 add a comment| up vote 2 down vote I had a similar problem in that

Reload to refresh your session. Sometimes, in the last days extremely frequent, after Rebuilding the Solution or just compiling it with 1-3 changed source files, I get the following error: 2>LINK : fatal error LNK1181: cannot Build FAILED. "C:\cygwin64\home\IEguy\repos\node-posix-ext\build\binding.sln" (default target) (1) -> "C:\cygwin64\home\IEguy\repos\node-posix-ext\build\posix-ext.vcxproj" (default target) (2) -> (ClCompile target) -> C:\Users\IEguy\.node-gyp\0.10.32\deps\v8\include\v8.h(179): warning C4506: no definition for inline function 'v8::Persistent v8::Persistent::New(v8::Handle)' [C:\cygwin64\home\IEguy\repos\node-posix-ext\build\posix-ext.vcxproj] C:\Users\IEguy\.node-gyp\0.10.32\deps\v8\include\v8.h(184): warning C4506: no definition I've made a sample project in 4.10, packaged it, and it all worked.

Problem went away after that. Our server issues ate one of my replies, but it was pretty speculative. You signed in with another tab or window. win_delay_load_hook.c LINK : fatal error LNK1181: cannot open input file 'gdi32.lib' [C:\~projects\needle\scripts\testing\build\modulename.vcxproj] gyp ERR!

Try to find which process keeps the thelibrary.lib opened. –Sasha Jun 23 '11 at 9:12 add a comment| up vote 8 down vote Go to: Project properties -> Linker -> General I am using visual studio 2013 –StraightCirle Jan 28 at 11:07 add a comment| up vote 3 down vote I had the same issue in both VS 2010 and VS 2012. a bullet shot into a suspended block Why germinate seeds outside of soil?