error xitwas not declared in this scope c Alna Maine

Address 101 Centre St, Bath, ME 04530
Phone (207) 443-9554
Website Link
Hours

error xitwas not declared in this scope c Alna, Maine

share|improve this answer answered Oct 18 '10 at 4:50 Ignacio Vazquez-Abrams 445k64796954 #include #include using namespace std; This is the current header. Hot Network Questions How would you help a snapping turtle cross the road? gcc.gnu.org/gcc-4.3/porting_to.html gcc.gnu.org/gcc-4.4/porting_to.html –Ignacio Vazquez-Abrams Oct 18 '10 at 5:12 Thank you very much. Can you give us a more minimal example without a mystery header so we can actually try compiling it ourselves?

Mistake 2 : exit() is a function and it is defined inside cstdlib header with respect to c++ and you haven't included it in the headers so the error not defined what's going on here? Any ideas?g++ -c main.cpp In file included from main.cpp:1:0: /usr/include/c++/4.8.1/cstdlib:118:11: error: ‘::div_t’ has not been declared using ::div_t; ^ /usr/include/c++/4.8.1/cstdlib:119:11: error: ‘::ldiv_t’ has not been declared using ::ldiv_t; ^ /usr/include/c++/4.8.1/cstdlib:121:11: error: my code is:: #include using namespace std; class Stack{ int *arr; int size; int top; public: Stack(){arr = NULL; top = 0;} Stack(int sz){ arr = new(nothrow) int[sz]; if(!arr) exit(1); size

Like I said, I have never had this problem until two days ago.When I change the includes to #include #include instead of #include #include as I originally had it, So you are likely to see tutorials and books that rely on this - and other - header dependencies that have now been cleaned up. Instead, everything that is needed has to be directly referenced with an #include. So, I noticed this yesterday, thinking it was application specific.

Deutsche Bahn - Quer-durchs-Land-Ticket and ICE Project going on longer than expected - how to bring it up to client? MisterEwok wrote:#include #include Use cstdlib.h instead of stdlib.h ,etc Send a Postcard! | Blog | PGP Key: F99FFE0FEAE999BD | Hapkido Brisbane Offline #11 2013-08-29 11:40:55 MisterEwok Member Registered: 2013-08-28 Posts: share|improve this answer edited Dec 15 '13 at 5:24 answered Dec 15 '13 at 0:23 Jerry Coffin 320k31352745 add a comment| Not the answer you're looking for? Show us the code...

Change the variable directory to the appropriate location. This sets the training … Recommended Articles HELP!So I'm write the mines game and so far I have just some of the coding Last Post 1 Hour Ago Is there a hamzah_1 1 post since Oct 2016 Newbie Member Best way to store data before moving to database Last Post 14 Hours Ago I use a webservice to pull some data from Is there any way to circumvent this?

Compile the code in verbose mode:g++ -v main.cppand post the output. How to handle a senior developer diva who seems unaware that his skills are obsolete? Many headers have now been cleaned up with the result that compilation is quicker. Thank you!

Posts: 5393 Re: CodeBlocks 10.05 - 'system' was not declared in this scope « Reply #2 on: June 03, 2010, 07:03:56 pm » Turning on Full Compiler Logging might help find Message Insert Code Snippet Alt+I Code Inline Code Link H1 H2 Preview Submit your Reply Alt+S Ask a Different Software Development Question Related Articles Class errors: "not defined in this scope" If gcc works on a c file, you should probably change the title to specify g++ as all the issues are c++ lib related. Browse other questions tagged c++ linux or ask your own question.

Your call. –Ignacio Vazquez-Abrams Oct 18 '10 at 5:08 1 Hmm, alright. You can download binaries for Windows and many major Linux distros here . more stack exchange communities company blog Stack Exchange Inbox Reputation and Badges sign up log in tour help Tour Start here for a quick overview of the site Help Center Detailed Reload to refresh your session.

Include attempted solutions, why they didn't work, and the expected results. Different Rectangle Types of nodes more hot questions question feed lang-cpp about us tour help blog chat data legal privacy policy work here advertising info mobile contact us feedback Technology Life I'm really close letting this program run. Send a Postcard! | Blog | PGP Key: F99FFE0FEAE999BD | Hapkido Brisbane Offline #8 2013-08-29 10:43:22 MisterEwok Member Registered: 2013-08-28 Posts: 38 Re: g++ isn't compiling! #include #include #include

http://wiki.codeblocks.org infinigon Multiple posting newcomer Posts: 10 Re: CodeBlocks 10.05 - 'system' was not declared in this scope « Reply #3 on: June 03, 2010, 11:24:01 pm » Have you included Here's the code for Stacks.h 1
2
3
4
5
6
7
8
9
10
11
12
13
14
15
16
17
18
19
20
21
22
23
24
#ifndef STACK #define STACK const int STACK_CAPACITY = 128; typedef int StackElement; class Stack { public: Stack(); bool empty() const; void push(const StackElement &value); Send a Postcard! | Blog | PGP Key: F99FFE0FEAE999BD | Hapkido Brisbane Offline #16 2013-08-30 12:36:27 MisterEwok Member Registered: 2013-08-28 Posts: 38 Re: g++ isn't compiling! Now I've tried compiling with multiple pieces of code that I've written, all of which compiled successfully at most a week ago.

I'm getting this error when compiling: $ g++ index.cpp index.cpp:85: error: 'friend' used outside of class index.cpp: In function 'std::ostream& operator<<(std::ostream&, const GrabStuff&)': index.cpp:88: … getaddrinfo() not declared in this scope Logical fallacy: X is bad, Y is worse, thus X is not bad How to get this substring on bash script? Tango Icons Tango Desktop Project. more stack exchange communities company blog Stack Exchange Inbox Reputation and Badges sign up log in tour help Tour Start here for a quick overview of the site Help Center Detailed

Why is this? false : true; } void pushElem(Stack &s, int i) { if(!s.isFull()) { cout << "Pushing " << i << " into stack" << endl; s.push(i); } else{ cout << "Error: Stack Typical errors look like these: error: 'find' is not a member of 'std' error: 'exit' was not declared in this scope Below is a table showing which header needs to be The downside is that programmers cannot rely on indirect inclusion of headers they may need anymore.

When I compile the project in Dev C++, I only get one error which is the [Error] 'exit' was not declared in this scope. c++ This article has been dead for over six months. more hot questions lang-cpp about us tour help blog chat data legal privacy policy work here advertising info mobile contact us feedback Technology Life / Arts Culture / Recreation Science Other Do you have any idea between what versions of gcc this change occurred? –Max Oct 18 '10 at 5:11 1 I don't know why you'd want to circumvent the standards.

This causes a number of problems with your code (not just Exit vs. Then make sure that you are using the std namespace i.e using namespace std;. Offline #4 2013-08-29 01:12:10 at0m5k Member Registered: 2013-07-22 Posts: 40 Website Re: g++ isn't compiling! Also run "pacman -Qkk" on gcc and glibc to check all files are fine.

New tech, old clothes The mortgage company is trying to force us to make repairs after an insurance claim How do I answer why I want to join a smaller company [email protected]:~/Desktop/test/Q1$ make g++ -o run main.cpp main.cpp: In function int main(): main.cpp:26: error: exit was not declared in this scope make: *** [run] Error 1 after i comment out then line Offline #7 2013-08-29 10:40:25 Allan is always right From: Brisbane, AU Registered: 2007-06-09 Posts: 10,447 Website Re: g++ isn't compiling! Adding extra headers to this is not an option at the moment. –Max Oct 18 '10 at 5:06 2 Then compiling it under recent versions of GCC is also not

How to mount a disk image from the command line? The webservice response is very slow (takes around 30 minutes to complete 600 transactions) & during this time, the MySQL is also giving slow ... What is the most expensive item I could buy with £50? header and access these functions from the std namespace.

Original comment by [email protected] on 4 Feb 2013 at 8:27 Sign up for free to join this conversation on GitHub. share|improve this answer answered Oct 18 '10 at 5:00 shuttle87 9,38144087 add a comment| up vote 2 down vote In terminal :- when you write man exit :- it will show For details and our forum data attribution, retention and privacy policy, see here Schindler's Tech List Two brothers and their software engineering experiences Home apm Atom Cython Firewall github Linux Earlier versions are considered obsolete.

exit is in . –chris Dec 14 '13 at 23:44 4 What's with the capitalization? Is there any alternative to the "sed -i" command in Solaris?