excute error Dwarf Kentucky

Computer and Network Building and repair, Maintenance, Upgrade, Hardware and software Configuration, wireless and wired Network repair and building and Computer Tutoring and Training

Address Salyersville, KY 41465
Phone (606) 205-1176
Website Link
Hours

excute error Dwarf, Kentucky

Perhaps the error messages you are getting are from failed attempts where there is no cobblestone in the area. Noom NotebookLookup 21,621 views 2:08 Tutoriol how to extract any file from winrar with CRC error fix repair - Duration: 3:50. So do we. The same thing happened when I gave the complete path to the input file.

Re: [Mrbayes-users] Error in command "execute" From: Seraina Klopfstein - 2012-09-24 07:34:48 Hi, You have to either copy the file into the same folder as the program, or you have Bizarrely, I tried this and it gave the error message, but worked anyway. Fractional second precision exceeds the scale specified in the parameter binding. Already have an account?

https://lists.sourceforge.net/lists/listinfo/mrbayes-users Thread view [Mrbayes-users] Error in command "execute" From: Livingstone Marmon - 2012-09-23 18:51:29 I'm new to MrBayes and am using version 3.2.0. Why did it take 10,000 years to discover the Bajoran wormhole? Fractional second precision exceeds the scale specified in the parameter binding" occurs when you use SAS/ACCESS Interface to ODBC with the BULKLOAD=YES option to write to SQL server tables that include Why is it a bad idea for management to have constant access to every employee's inbox How to cope with too slow Wi-Fi at hotel?

No, thanks http://info.appdynamics.com/FreeJavaPerformanceDownload.html _______________________________________________ Mrbayes-users mailing list [email protected] Show more Language: English Content location: United States Restricted Mode: Off History Help Loading... Shafi Pulikkal 218,317 views 7:00 How to Repair Winrar Corrupted Files (rar, partx.rar) Work with Recovery Records Only - Duration: 2:08.

it's a modern post apocalyptic magical dystopia with Unicorns and Gryphons What is the most expensive item I could buy with £50? Watch Queue Queue __count__/__total__ Find out whyClose how to fix winrar extracting error because cannot execute EZ GAMING SubscribeSubscribedUnsubscribe2222 Loading... Mobile View Skip to content Ignore Learn more Please note that GitHub no longer supports old versions of Firefox. SKIPPED [INFO] com.capitalone.dashboard:github-scm-collector ......

Digital Diversity My CEO wants permanent access to every employee's emails. Solve and naming variables What are Imperial officers wearing here? Determine if a coin system is Canonical Is there any job that can't be automated? SUCCESS [ 25.247 s] [INFO] com.capitalone.dashboard:api .......................

SKIPPED [INFO] ------------------------------------------------------------------------ [INFO] BUILD FAILURE [INFO] ------------------------------------------------------------------------ [INFO] Total time: 6.846 s [INFO] Finished at: 2015-12-21T13:32:07-08:00 [INFO] Final Memory: 25M/61M [INFO] ------------------------------------------------------------------------ [ERROR] Failed to execute goal com.mysema.maven:apt-maven-plugin:1.1.3:process (default) on The tutorial begins with executing a file called primates.nex. Subject: [Mrbayes-users] Error in command "execute" I'm new to MrBayes and am using version 3.2.0. Operating System and Release InformationProduct FamilyProductSystemSAS ReleaseReportedFixed*SAS SystemSAS/ACCESS Interface to ODBCMicrosoft® Windows® for x649.4 TS1M19.4 TS1M2Microsoft Windows 8 Enterprise 32-bit9.4 TS1M19.4 TS1M2Microsoft Windows 8 Enterprise x649.4 TS1M19.4 TS1M2Microsoft Windows 8 Pro

Published on Jul 28, 2013how to fix winrar extracting error'CANNOT EXECUTE" Category People & Blogs License Standard YouTube License Show more Show less Loading... Unfortunately, whenever I give the command *execute primates.nex*, the following error appears: *Executing file "primates.nex" Could not open file "primates.nex" Error in command "Execute"* So what's going on here? The SQL is checked and is Ok. On Mon, Sep 24, 2012 at 1:14 AM, Seraina Klopfstein < [email protected]> wrote: > Hi, > You have to either copy the file into the same folder as the program, or

Need book id. I am using the Windows 7 64-bit operating system. Determine if a coin system is Canonical "Rollbacked" or "rolled back" the edit? i googled to make sure, and it led me to this answer.

Why does argv include the program name? After the 'replace', 'destroy' or 'keep' the only thing which you can use are data tags, like if it was a command block for example, a data tag like this: {Command:say Let me know if that helps... Working...

Advertisement Autoplay When autoplay is enabled, a suggested video will automatically play next. Is there something I'm doing wrong or something wrong in the files? Sign in to make your opinion count. Loading...

The tutorial begins with > executing a file called primates.nex. With the passing of Thai King Bhumibol, are there any customs/etiquette as a traveler I should be aware of? Hope this helped. Why is absolute zero unattainable?

Sign in to report inappropriate content. Sign in to make your opinion count. ClicksGuide 1,414 views 1:05 WinRAR Next volume is required - Duration: 4:20. عبدالوارث الهوساوي 23,034 views 4:20 Como solucionar error de winrar que no deja extraer archivos - Duration: 2:10. Reload to refresh your session.

Terms Privacy Security Status Help You can't perform that action at this time. Loading... How to deal with players rejecting the question premise Why are unsigned numbers implemented? Shinichi kudo 359 views 1:15 DirectX Internal System error refer to directx log fix - Duration: 3:42.

TH With the passing of Thai King Bhumibol, are there any customs/etiquette as a traveler I should be aware of? Asktrustdee.com 4,097 views 1:53 How to Fix WinRAR Extraction Errors Repair WinRAR File - Duration: 1:41. MOHSINWORLD 222,886 views 1:16 how to fix winrar diagonistic error updated 26-dec- 2014 100% working - Duration: 1:15. Sign in to add this to Watch Later Add to Loading playlists...

What kind of bicycle clamps are these? Erick Cocoba 23,443 views 0:27 Loading more suggestions... Sum of neighbours Developing web applications for long lifespan (20+ years) How to solve the old 'gun on a spaceship' problem? Yes i tried.

Loading... If not then the command block won't detect it and will fail to execute it because all requirements aren't met. I checked the php.net and looks like you have not needed single quotes in prepare statement. –Mihkel Viilveer Apr 26 '13 at 11:41 Thanks again. Please can someone help [INFO] BUILD FAILURE [INFO] ------------------------------------------------------------------------ [INFO] Total time: 06:03 min [INFO] Finished at: 2016-02-03T06:50:30-05:00 [INFO] Final Memory: 101M/241M [INFO] ------------------------------------------------------------------------ [ERROR] Failed to execute goal com.github.eirslett:frontend-maven-plugin:0.0.25:npm (npm

Is there something I'm doing wrong or something > wrong in the files? Windows and Linux Tutorials from Howtech 350,164 views 1:44 How to Fix Could Not Find Extraction Path with WinRAR **VERY SIMPLE** - Duration: 1:34. BibinCTS commented Feb 4, 2016 Thanks for your Reply Jim.