fatal error u1077 nmake Keosauqua Iowa

Address 504 N 4th St Ste 203, Fairfield, IA 52556
Phone (641) 472-3602
Website Link
Hours

fatal error u1077 nmake Keosauqua, Iowa

But I noticed that when I downloaded the cygwin there's a link.exe in C:\cygwin64\bin. The mortgage company is trying to force us to make repairs after an insurance claim Is the NHS wrong about passwords? That is, for generating code for RMON-MIB, you have to load RMON-MIB, TOKEN-RING-RMON-MIB, and RFC1213-MIB. Dev centers Windows Office Visual Studio Microsoft Azure More...

You need to install the 7.1 SDK (see http://stackoverflow.com/questions/1865069/how-to-compile-a-64-bit-application-using-visual-c-2010-express ) and ensure that it's part of your PATH environement variable. (02 Sep '14, 22:18) Pascal Quantin oh ok. As a result, your viewing experience will be diminished, and you have been placed in read-only mode. Any help would be greatly appreciated!! Why does argv include the program name?

The content you requested has been removed. The mortgage company is trying to force us to make repairs after an insurance claim House of Santa Claus Any better way to determine source of light by analyzing the electromagnectic How should I interpret "English is poor" review when I used a language check service before submission? This utility will help you set up a default compiler.Please choose your compiler for building MEX-files:Would you like mex to locate installed compilers [y]/n?What should I do next to fix this

Thanks. If you are using MS VC++, you can do this by running "vcvars32.bat" present in the "Bin" directory of your VC++ installation. It's free! All rights reserved.

All rights reserved. "C:\Program Files (x86)\Microsoft Visual Studio 14.0\VC\BIN\nmake.exe" -f Makefile.Release Microsoft (R) Program Maintenance Utility Version 14.00.23026.0 Copyright (C) Microsoft Corporation. template instantiation link error1vlfeat nmake: fatal error U1073: don't know how to make “msvcr100.dll”0Build a multi-directory project with nmake and microsoft compiler0Code:Blocks and Intel C compiler == ERRORS0Debugging NMake file for The errors below are for win32 build. The fatal error from nmake I get is appended below.

Following this instruction I was able to solve this issue, but unfortunately encountered another error related to the compiler (which will be posted as a seperate discussion). NMAKE : fatal error U1077: '"C:\Program Files (x86)\Microsoft Visual Studio 14.0\VC\BIN\amd64\nmake.exe"' : return code '0x2' Stop. I just removed the old folder one and unpacked a clean version. Could you be a little more specific?

My CEO wants permanent access to every employee's emails. Error Message Compilation errors while generating code for a MIB which has an external index reference. To save some time, here's my PATH %SystemRoot%\system32\WindowsPowerShell\v1.0\;C:\Windows\system32;C:\Windows;C:\Windows\System32\Wbem;C:\SysinternalsSuite\;C:\Program Files\Microsoft\Web Platform installer\;C:\Windows\System32\WindowsPowerShell\v1.0\;C:\Program Files (x86)\GNU\GnuPG\pub;C:\Program Files (x86)\Git\cmd;C:\Program Files (x86)\Windows Kits\8.1\Windows Performance Toolkit\;C:\Program Files\Microsoft SQL Server\110\Tools\Binn\;C:\Program Files (x86)\Microsoft SDKs\TypeScript\1.0\;C:\Program Files\Perl\bin;C:\Program Files\OpenSSL\bin;C:\Program Files (x86)\Microsoft Visual And what about "double-click"?

ml64 -c -coff -Zi -DASMV -DASMINF contrib/masmx64\inffasx64.asm 'ml64' is not recognized as an internal or external command, operable program or batch file. NMAKE : fatal error U1077: '"C:\Program Files (x86)\Microsoft Visual Studio 10.0 \VC\BIN\nmake.exe"' : return code '0x2' Stop. (03 Sep '14, 07:31) christenmu Sorry, I just realized that I was using the Running syncqt... I'm struck with this building error.

NMAKE : fatal error U1077: '"C:\Program Files (x86)\Microsoft Visual Studio 14.0\VC\BIN\nmake.exe"' : return code '0x2' Stop. Books for chess traps more hot questions question feed lang-cpp about us tour help blog chat data legal privacy policy work here advertising info mobile contact us feedback Technology Life / Any clue on what could be wrong? It should be something like: set VS2008_PATH=C:\Program Files\Microsoft Visual Studio 10.0 Log in to reply.

Share?Profiles ▼Communities ▼Apps ▼ Forums IBM Rational Rhapsody Log in to participate Expanded section▼Topic Tags ? C:\Program Files (x86)\Microsoft Visual Studio 14.0\VC\INCLUDE\cstdint(47): error C2039: 'int_fast16_t': is not a member of '`global namespace'' C:\Program Files (x86)\Microsoft Visual Studio 14.0\VC\INCLUDE\cstdint(47): error C2873: 'int_fast16_t': symbol cannot be used in a Tags: build_error ×18 fatal ×2 Asked: 02 Sep '14, 09:55 Seen: 6,884 times Last updated: 03 Sep '14, 08:41 Don't have Wireshark? You should rather run your configuration from a new command line instance.

Register here. See ASP.NET Ajax CDN Terms of Use – http://www.asp.net/ajaxlibrary/CDN.ashx. ]]> Developer Network Developer Network Developer Sign in MSDN subscriptions c:\Software\Qt\4.8.6> I have one environment variable set up in my path C:\Software\Qt\4.8.6\bin and I'm running Windows 7 x64. however, i get a new error now, any chance you could guide me as to why this arises: NMAKE : fatal error U1073: don't know how to make 'dist' –Cel May

You should use vcvarsall.bat to configure your path properly. Wireshark documentation and downloads can be found at the Wireshark website. How do I explain that this is a terrible idea? Onto the next one!Thanks again! 0 Comments Show all comments Log In to answer or comment on this question.

Log in with Google account | Log in with Yahoo account | Log in with Facebook account No account? For example, to generate code for RMON2-MIB, you have to add all the MIBs on which the particular MIB depends. Learning resources Microsoft Virtual Academy Channel 9 MSDN Magazine Community Forums Blogs Codeplex Support Self support Programs BizSpark (for startups) Microsoft Imagine (for students) United States (English) Newsletter Privacy & cookies NMAKE : fatal error U1077: '"c:\Program Files\Microsoft Visual Studio\VC98\bin\nmake.exe"' : return code '0x2' Stop.

asked 5 years ago viewed 7909 times active 8 months ago Related 2Handling nmake errorlevel/return codes0Compile only modified files with nmake0porting C compilation from MinGW to VisualStudio(nmake)1Error - Compiling Gnuplot on Thanks! If you don't want to use "-c", then you need to write your own Makefile (as like in your application) to compile the agent's *.c and *.h files. NMAKE : fatal error U1077: 'cd' : return code '0x2' Stop.

I guess the issue is here: call "%NMAKEHOME%\nmake" %NMAKE_Opts% "MSVCDIR=%MSVCDIR%" "PLATSDKDIR=%PLATSDKDIR%" "APACHE22_HOME=%APACHE22_HOME%" "APSRC=%APSRC%" "DEBUG=%DEBUG%" dist share|improve this answer answered May 24 '11 at 15:26 BlackBear 12.9k72763 1 thanks! To continue the NMAKE session for unrelated parts of the dependency tree, use the /K option. I was unable to fix it by following SOLUTION 1, hence I went ahead with SOLUTION 2 and reinstalled MATLAB into a folder on the C: drive with a name that Riverbed is Wireshark's primary sponsor and provides our funding.

Join them; it only takes a minute: Sign up nmake compilation error up vote 3 down vote favorite I'm very new to C and am trying to compile to a specific Dev centers Windows Office Visual Studio Microsoft Azure More... Compilation Failed Reason Agent Compiler requires the environment variables of VC++ to be set appropriately before starting it. Foo 2.

pch -TP qmake_pch.h NMAKE : fatal error U1077: '"C:\Program Files\Microsoft Visual Studio 10.0\VC\bin\cl.EXE"' : return code '0xc0000135' Stop. Visual C++ Programmer's Guide Build Errors NMAKE Errors U1000 through U4011 NMAKE Errors U1000 through U4011 NMAKE Fatal Error U1077 NMAKE Fatal Error U1077 NMAKE Fatal Error U1077 NMAKE Fatal Error Need programmers to hire ? Reload the page to see its updated state.

Build successfully now. All rights reserved. Where does the prepend of "cl" to the command come from?