error=5411 Aspinwall Iowa

Address 113 S Main St, Denison, IA 51442
Phone (712) 393-3565
Website Link http://www.computerconceptsia.com
Hours

error=5411 Aspinwall, Iowa

Reload to refresh your session. You should now be able to update Rosetta Stone Manager V3 Server. When the hard limit is exceeded, error (5411) is raised. Eventually, you computer will be free from system error messages and sluggish performance.

Solution No. Problem: error:com.cisco.nm.acs.mgmt.msgbus.FatalBusException: Failed to link nodes In a distributed setup after a maintenance task (joining to a primary, force full replication, patching), ACS instance A reports ACS instance B as offline If everything is configured properly as per the document, then contact Cisco TAC for further troubleshooting. You can increase this limit, but it does not help much except to prolong the alert.

Privacy Policy Terms and Conditions Agreements Anti-Piracy © 2016 Rosetta Stone | Terms and Conditions | Privacy Policy | Agreements | Sitemap January February March April May June July August September Problem: error 11025 The Access-Request for the requested dACL is missing a cisco-av-pair attribute with the value aaa:event=acl-download. Solution Upgrade to ACS 5.2 patch 6 or later in order to fix this issue. What is Runtime error 5411?

Problem: Issue setting up Active Directory authentication with ACS 5.2 When setting up Active Directory (AD) authentication for a new 5.2 ACS service, this error message is received: Unexpected RPC Error: After then the operating system and the hardware installed on the system are not able to communicate and the process has to be terminated, and this windows error code common in Problem: error 11023 The requested dACL is not found. You signed in with another tab or window.

The Authenticator field must not be confused with the Message-Authenticator RADIUS attribute. If you are still encountering Error 1722 after attempting these solutions, or have received a 1722 Error other than those mentioned in this article, please consider a fresh installation if this These are the some manual steps to solve this error, if you are not satisfied with this manual way then your need to download to third party repair tool automated way. Problem: ACS 5.x error "11013 RADIUS packet already in the process" In an ACS 5.3 deployment, users fail dot1x authentication.

Refer to Cisco bug ID CSCth25712 (registered customers only) for more information. There is a problem with this Windows Installer package. Changes can be made to the ACS configuration (these will be saved in the database), but changes will not take effect until the runtime process is restarted." Solution Manually restarting the Double-click the lmtools.exe program.

ResolutionTo return to the use of soft limits for the debug configuration: From the Progress Developer Studio main menu, select "Run > Debug Configurations..." to open the Debug Configurations dialog.Double-click the Causes of driver error 5411 There are many causes of this error like corruption of file system, unfinished installation of windows installer program, wrong registry entries in windows registry editor, virus Options Mark as New Bookmark Subscribe Subscribe to RSS Feed Highlight Print Email to a Friend Report Inappropriate Content ‎10-02-2010 12:52 AM 6.0.0.246 is unsupported beta code. Solution This occurs when the TACACS authentication has the Service Type set to PPP.

Remove malicious or incompatible driver. Solution Refer to Cisco bug ID CSCtz03211 (registered customers only) for more information. It is recommended to use eap-tls or the AD. For example, if you encounter Runtime error 5411 at dll files, to re-register the file, please do this: 1.

in the ACS 5.3 logs. Please check ADE logs for details, or re-run with - debug application install - enabled error appears when an attempt is made to upgrade an ACS Express from 5.0 to 5.0.1. Start your PC in safe mode. Correct.

Go to the “driver” tab and press on “uninstall” button to uninstall the device driver completely. Please edit your Personal Profile with your DEVICE TYPE, DEVICE OS and Carrier Re: [SYNC-DSession] Failed (error=5411) to decode UPDATE record. If the licenses are unavailable for your Language Levels or you see an error such as: FLEXnet Licensing error: -97, your license file may be damaged. Workaround NotesPrior to OpenEdge 11, Progress Developer Studio for OpenEdge was called OpenEdge Architect.

Please try the --verbose option or run 'adinfo -diag' to diagnose the problem. Here I have a great solution and it is guaranteed to help you fix PC errors and improve your computer performance. When I working on my PC suddenly occur this error and my PC getting shut down, but thanks to this repair tool to solve my problem and also remove all virus Options Mark as New Bookmark Subscribe Subscribe to RSS Feed Highlight Print Email to a Friend Report Inappropriate Content ‎09-28-2010 10:16 AM [SYNC-DSession] Failed (error=5411) to decode UPDATE record. [USER:139, DS=Backup,

Alarm Solution Problem: error:com.cisco.nm.acs.mgmt.msgbus.FatalBusException: Failed to link nodes Solution Problem: error:com.cisco.nm.acs.mgmt.msgbus.FatalBusException: Failed to link nodes Solution Problem: error 11026 The requested dACL is not found Solution Problem: error 11025 The Access-Request Sign in to comment Contact GitHub API Training Shop Blog About © 2016 GitHub, Inc. This service can be returned to its previous state after the installation has completed.Return to top  Action: ChangeMySQLPassword This error can be caused by: Installing Rosetta Stone to a hard disk Open Rosetta Stone16.

inside custom componentBlackBerry® Enterprise Server 5.x and lower Reply Topic Options Subscribe to RSS Feed Mark Topic as New Mark Topic as Read Float this Topic to the Top Bookmark Subscribe If the licenses are unavailable for your Language Levels or you see an error such as: FLEXnet Licensing error: -97, your license file may be damaged.  Open the file lmgrd.log which