fatal error asm/types.h no such file or directory Hoopeston Illinois

We provide support for ALL brands of printers. And other computer peripherals. ALL kinds of desktops / laptops are supported. We Also provide support for ALL kind of OS versions like microsoft windows XP. Microsoft windows 7. Microsoft windows 8 & 8.1 and microsoft windows 10. Apple devices are Also supported like IMACS. IPHONES. Ipads and ipods. We Also support ALL kind of email problems related to ANY email service providers. We Also provide support for ISP issues.

Address Paris, IL 61944
Phone (844) 898-9969
Website Link
Hours

fatal error asm/types.h no such file or directory Hoopeston, Illinois

When executing the install.sh script the Mellanox drivers try to compile a kernel module but that fails with the message: /usr/src/linux-3.7.10-1.1/arch/x86/include/asm/types.h:4:31: fatal error: asm-generic/types.h: No such file or directory compilation terminated. And what about "double-click"? How to decrypt a broken S/MIME message sent by Outlook? Join them; it only takes a minute: Sign up Here's how it works: Anybody can ask a question Anybody can answer The best answers are voted up and rise to the

asked 3 years ago viewed 6088 times active 2 years ago Linked 2 “bitsperlong.h” : trouble cross-building Perf for ARM (Android) 0 Cross compile module with arm-eabi-gcc Related 1cross compilation of Reply With Quote 02-May-2013,08:49 #9 uvoigt View Profile View Forum Posts View Blog Entries View Articles Newcomer Join Date Nov 2009 Posts 29 Re: Kernel module compilation failed: asm-generic/types.h: No such If you lack such a folder reinstall build-essentials and verify the folder exists.sudo apt-get install --reinstall build-essential Altern likes this "No technology can ever be too arcane or complicated for the Code: mstflint-1.4mlnx4-1.21.gd948ddd.src.rpm mlnx_en-1.5.10-1.src.rpm mellanox-mlnx-en-1.5.10-1.src.rpm GNOME Version 3.16.2 openSUSE Leap 42.1 (x86_64) 64-bit Kernel Version 4.1.12-1.1 www.vazhavandan.blogspot.com Reply With Quote 19-Apr-2013,09:07 #6 wolfi323 View Profile View Forum Posts View Blog Entries View

Not sure if it helps. –slm♦ Jan 13 '14 at 1:29 What directory are you running make from? –peterph Jan 14 '14 at 9:33 add a comment| active oldest I am using openSUSE 12.3 with all updates installed (19.04.2013). After this operation, 0B of additional disk space will be used. Physically locating the server Logical fallacy: X is bad, Y is worse, thus X is not bad (KevinC's) Triangular DeciDigits Sequence Does the recent news of "ten times more galaxies" imply

asked 2 years ago viewed 7066 times active 6 months ago Linked 1 Missing modversions.h Related 0LiveCD Ubuntu 12.04, can't open file “Kconfig”0I am trying to build a Realtek 8723e module yes checking for GCC 4+ atomic builtins... Can an ATCo refuse to give service to an aircraft based on moral grounds? How is the Heartbleed exploit even possible?

but here is something else (still no /usr/include/asm):As far as I can tell Build-essential should install a /usr/include/asm-generic folder. What are "desires of the flesh"? Any ideas? Does the recent news of "ten times more galaxies" imply that there is substantially more mass?

The types.h that includes the missing header files are not from Mellanox so I guess it is an opensuse related problem. Code: mstflint-1.4mlnx4-1.21.gd948ddd.src.rpm mlnx_en-1.5.10-1.src.rpm mellanox-mlnx-en-1.5.10-1.src.rpm The install.sh script installs the sources and compiles the module. asked 2 years ago viewed 7066 times active 6 months ago Linked 1 Missing modversions.h Related 0LiveCD Ubuntu 12.04, can't open file “Kconfig”0I am trying to build a Realtek 8723e module P.S: I`m not sure if asm and asm-generic are same or not.

When I now call make, the compiler can't find the headers because the references are made from ../. But the given file above is missing. All suggestions are welcomed, Thanks in advance. Is the NHS wrong about passwords?

Ubuntu Logo, Ubuntu and Canonical Canonical Ltd. no checking for getpagesize() in unistd.h... Is "halfly" a word? Removing elements from an array that are in another array Is the mass of an individual star almost constant throughout its life?

What does かぎのあるヱ mean? Other Informations OS: Ubuntu 12.04 Kernel Version: 3.8.0-29 Program I`m trying to compile:http://sourceforge.net/projects/aodvuu/ Last edited by Ashiq_Irphan; December 12th, 2013 at 09:07 AM. Because I'm going to live forever.'' — Linus Torvalds ``Don’t argue with idiots because they will drag you down to their level and then beat you with experience.'' — Greg King drwxr-xr-x 7 root root 4096 Jan 5 17:04 ..

lrwxrwxrwx 1 root root 41 Jan 5 14:44 acpi -> ../../linux-headers-3.0.0-14/include/acpi lrwxrwxrwx 1 root root 7 Jan 5 17:04 asm -> asm-x86 --------------------------->>>>>>>>>>>>>> LINK BROKEN TOO! (no asm-x86 dir) lrwxrwxrwx 1 Need to get 0B/7,278B of archives. I`m in the process of making changes in order to make it possible to run on Ubuntu 12.04. or Compile this program against it's supported Kernel version, if you have that info.

How to mount a disk image from the command line? How to mount a disk image from the command line? But compiling fails with the given message. Advanced Search

Forum English Get Technical Help Here Hardware Kernel module compilation failed: asm-generic/types.h: No such file or directory Welcome!

have you installed the source for your kernel, and the "Base Development" and "C/C++ Development" patterns those are default installed by some linux distros, but not this one.. -- dd openSUSE®, Hot Network Questions Did Sputnik 1 have attitude control? Why does argv include the program name? Sum of neighbours Going to be away for 4 months, should we turn off the refrigerator or leave it on with water inside?

Cover an unusual board with minimum chess rooks What are Imperial officers wearing here? Does it matter which side up a seed is planted? The time now is 07:13. © 2015 SUSE, All Rights Reserved. make[2]: *** [/home/terenesas/sample/helloworldtest_module.o] Error 1 make[1]: *** [_module_/home/terenesas/sample] Error 2 make[1]: Leaving directory `/usr/src/linux-headers-3.2.0-29-generic' make: *** [modules_install] Error 2 What did I do wrong?

This is necessary to compile Code in linux and I had falsely assumed you had it installed.First delete the link we made:sudo rm /usr/include/asmthen install build-essentialsudo apt-get install build-essentialNow recreate the This riddle could be extremely useful How would you help a snapping turtle cross the road? more stack exchange communities company blog Stack Exchange Inbox Reputation and Badges sign up log in tour help Tour Start here for a quick overview of the site Help Center Detailed When I try to make, I get the following error Code: In file included from /lib/modules/3.8.0-29-generic/build/include/linux/types.h:5:0, from /lib/modules/3.8.0-29-generic/build/include/linux/list.h:4, from /lib/modules/3.8.0-29-generic/build/include/linux/module.h:9, from kaodv-mod.c:30: /lib/modules/3.8.0-29-generic/build/include/uapi/linux/types.h:4:23: fatal error: asm/types.h: No such file or directory

more hot questions question feed about us tour help blog chat data legal privacy policy work here advertising info mobile contact us feedback Technology Life / Arts Culture / Recreation Science Unix & Linux Stack Exchange works best with JavaScript enabled Skip to content Ignore Learn more Please note that GitHub no longer supports old versions of Firefox. Username Forum Password I've forgotten my password Remember me This is not recommended for shared computers Sign in anonymously Don't add me to the active users list Privacy Policy current community New tech, old clothes Did Sputnik 1 have attitude control?

i reinstall all kernel-headers i have installed previously but no luck. This site is not affiliated with Linus Torvalds or The Open Group in any way. will teach us http://en.opensuse.org/User:Knurpht http://nl.opensuse.org/Gebruiker:Knurpht Reply With Quote 19-Apr-2013,08:48 #5 vazhavandan View Profile View Forum Posts View Blog Entries View Articles Omniscient Penguin Join Date May 2010 Location Space Colony Lagrange Not the answer you're looking for?

Several functions may not work. And maybe you would also need "kernel-desktop-devel". (or the corresponding one if you use a different kernel, e.g. "kernel-default-devel" if you're using "kernel-default") Thanks. Cyberpunk story: Black samurai, skateboarding courier, Mafia selling pizza and Sumerian goddess as a computer virus Replace lines matching a pattern with lines from another file in order This riddle could You need to specify the source directory of your ARM Kernel.

Makefile:237: recipe for target 'linux_inet_diag.o' failed make: *** [linux_inet_diag.o] Error 1 make failed, exit code 2 If I try to modprobe inet_diag I get modprobe: can't change directory to '/lib/modules': No yes checking for mremap() in sys/mman.h...