fatal error linux/videodev.h datei oder verzeichnis nicht gefunden Kealia Hawaii

Address 4480 Ahukini Rd Ste 101, Lihue, HI 96766
Phone (808) 245-6227
Website Link
Hours

fatal error linux/videodev.h datei oder verzeichnis nicht gefunden Kealia, Hawaii

Pare. hdf5 is installed and apparently I just need to tell make where to find it. Reply Saeid Yazdani 28-01-2016 at 11:32 Hey, It is most likely you have not executed the "cmake" step. However, when I tried to use some Gpu functions (compiled successfully), I got the following running ERRORS: OpenCV Error: Gpu API call (unknown error) in allocate, file /home/jiang/CvLibs/opencv/modules/core/src/cuda/gpu_mat.cu, line 71

Stop. << i got this message at the last step And, how do i compile the program? I have checked the directory of the image and it remains the same even with absolute directory. What's the most recent specific historical element that is common between Star Trek and the real world? A bullet shot into a door vs.

Please note that removing files can be dangerous so do this on your own risk! make[2]: *** [modules/highgui/CMakeFiles/opencv_highgui.dir/src/cap_v4l.o] Error 1 make[1]: *** [modules/highgui/CMakeFiles/opencv_highgui.dir/all] Error 2 make: *** [all] Error 2 Is there a solution for this ? File trees, do on!Thanks Posts: 50Joined: Mon Jun 02, 2014 11:54 pm

Post a reply 10 posts Return to Troubleshooting Jump to: Select a forum ------------------ Community Why is absolute zero unattainable?

My distribution is Fedora 20 KDE x86_64. Make space between rows constant Can Dandelion defeat you? Before starting, keep in mind that you can install pygame using apt-get under ubuntu or yum under Fedora, but again here this is within a virtual environment. Reply stefano 08-06-2016 at 13:47 Thank you for the tutorial however during the "make" i have the following error: …. //usr/lib/x86_64-linux-gnu/libvtkIOImage-6.2.so.6.2: undefined reference to [email protected]_4.0'
//usr/lib/x86_64-linux-gnu/libvtkIOImage-6.2.so.6.2: undefined reference to [email protected]_4.0′

What did I do wrong, and how can I fix this? yes checking for stdio.h... yes configure: creating ./config.status config.status: creating thread1.conf config.status: creating thread2.conf config.status: creating thread3.conf config.status: creating thread4.conf config.status: creating motion-dist.conf config.status: creating motion.init-FreeBSD.sh config.status: creating motion.init-Debian config.status: creating motion.init-Fedora config.status: creating motion.spec Please refer to our Privacy Policy or Contact Us for more details You seem to have CSS turned off.

yes checking sys/mman.h presence... Note hoewever, that you may have other missing libraries. Is it appropriate to tell my coworker my mom passed away? And later it tells to download OpenCV2.2 source code.

You can replace this double dots with a fixed path e.g. /path/to/your/sourcefiles Reply Oguz 19-04-2016 at 17:39 I am having same error above. The terminal is now saying /opt/opencv/release/modules/hdf/precomp.hpp.gch/opencv_hdf_RELEASE.gsh is not compatible with this GCC version. I know I have libavcodec-dev installed, along with the other required packages mentioned in this post, so I'm a bit lost as to why it doesn't succeed. Reply Pruthvi 10-06-2016 at 00:20 Hi…Can you tell where the CMakeLists.txt file is?

but i`m having problem when i follow the cmake step. /opt/opencv/release$ cmake -D CMAKE_BUILD_TYPE=RELEASE -D CMAKE_INSTALL_PREFIX=/usr/local -D OPENCV_EXTRA_MODULES_PATH=/opt/opencv_contrib/modules /opt/opencv/ CMake Error: The source directory "/opt/opencv" does not exist. Is accuracy a binary? So if you want to install this new version, whether you ¬†already have an older version installed or you just want to install it on a fresh GNU/Linux machine…you have come But I think you have missed some steps…maybe you have not installed the prerequisite packages, or you forgot to checkout the 3.1.0 branch for both OpenCV and contrib repositories, or you

What are Imperial officers wearing here? yes checking stdio.h usability... I followed the instructions and have installed opencv 3.1.0. Well, refer to bukzor's answer below for that. –isync Aug 13 '15 at 15:26 add a comment| up vote 64 down vote The current answer is incomplete.

Does chilli get milder with cooking? error: Setup script exited with error: command 'gcc' failed with exit status 1 and running sudo ln -s /usr/include/linux/videodev2.h /usr/include/linux/videodev.h gives: Continuing With "setup.py" warning: no files found matching 'readme.txt' no more stack exchange communities company blog Stack Exchange Inbox Reputation and Badges sign up log in tour help Tour Start here for a quick overview of the site Help Center Detailed Please don't fill out this field.

House of Santa Claus need book id, written before 1996, it's about a teleport company that sends students learning to become colonists to another world New tech, old clothes What is Alberto's answer, coupled with Niroshan's comment helped me solve it. It could be the default GCC is not 4.8 Also I have not tested on Ubuntu 12 so I can't say for sure Reply Pingback: Opencv 3.1 installation note - vincentweisen Do I need to move something to my /usr/bin to fix this?

Thank you in advance Reply Saeid Yazdani 08-06-2016 at 14:07 What is your GCC version? Otherwise, use python-pip to install pygame: sudo pip install pygame Why use pip over easy_install? I now have more compilation errors though. Just take a note from things that are going to be removed.

First "opencv" and second "opencv_contrib". asked 3 years ago viewed 18790 times active 1 year ago Linked 0 Error installing pygame: “error: command 'x86_64-linux-gnu-gcc' failed with exit status 1” Related 3How to build PyQt for Deadsnakes Or do I have to uninstall the current version. When I run my application with installed contributed modules, the message error: Unhandled exception at 0x000007fee423903f (opencv_imgproc310d.dll) I used cmake-3.5.1 with options: - With CUDA: On - With OpenGL: On -

Stop. Thanks so much, email me and i'll send you a link to drive the rover! Installing libv4l-dev creates a /usr/include/linux/videodev2.h but doesn't solve the stated problem of not being able to find linux/videodev.h. Hunting dependencies...

Reply chaiein 14-02-2016 at 11:14 Even I got the same problem. motion.h:43:28: fatal error: linux/videodev.h: No such file or directory compilation terminated. gcc -E checking for grep that handles long lines and -e... /bin/grep checking for egrep... /bin/grep -E checking for ANSI C header files... How do computers remember where they store things?

CMakeFiles/Makefile2:6038: recipe for target ‘modules/videoio/CMakeFiles/opencv_videoio.dir/all' failed make[1]: *** [modules/videoio/CMakeFiles/opencv_videoio.dir/all] Error 2 make[1]: *** Waiting for unfinished jobs…. [ 43%] [ 43%] Built target opencv_dnn Makefile:147: recipe for target ‘all' failed make: How?