failed to create assembly error adding file to archive Hahira Georgia

Address 13560 Highway 76, Adel, GA 31620
Phone (229) 588-2211
Website Link
Hours

failed to create assembly error adding file to archive Hahira, Georgia

In other words you need to maintain two areas, the dependencies as well as the descriptor. Then, can you check actual command line used to launch maven as explained in [1]. This riddle could be extremely useful What kind of bicycle clamps are these? The solution of this problem is to remember that maven has a reactor which can be used for such purposes instead of the file level.

share|improve this answer edited Jul 18 '11 at 19:41 answered Jul 18 '11 at 18:16 Jarrod Roberson 39.9k15109186 add a comment| up vote 3 down vote Your problem: Error adding file Note that m2e always uses embedded maven during eclipse build. Full console: http://hudson.magnolia-cms.com/view/X/job/magnolia-module-commenting/670/console Example - Commenting failing with error: [ERROR] BUILD ERROR [INFO] ------------------------------------------------------------------------ [INFO] Failed to create assembly: Error adding file 'info.magnolia:magnolia-module-standard-templating-kit:jar:2.0' to archive: /usr/local/hudson/maven-local-repo/info/magnolia/magnolia-module-standard-templating-kit/2.0/magnolia-module-standard-templating-kit-2.0.jar isn't a file. Does m2e use correct maven installation? [1] http://docs.codehaus.org/display/M2ECLIPSE/Project+FAQ#ProjectFAQ-HowtoretrieveanactualcommandlineusedtostartJVMandMaven-- Regards, Igor Scara Maccai wrote: > > Eugene Kuleshov wrote: >> Sara, >> >> This question is answered in the project FAQ at

Eugene Kuleshov Reply | Threaded Open this post in threaded view ♦ ♦ | Report Content as Inappropriate ♦ ♦ Re: "Failed to create assembly" using the plugin Sara, This Already have an account? Reload to refresh your session. There is an NPE bug affecting version 2.3.0, which has been fixed in version 2.4.0.

It wasn't accurate It wasn't clear It wasn't relevant Submit feedback Cancel Have a question about this article? In a mean time you can also try Maven 3.0alpha and see if it works with your project and report any issues to the Maven project. SKIPPED [INFO] ------------------------------------------------------------------------ [INFO] BUILD FAILURE [INFO] ------------------------------------------------------------------------ [INFO] Total time: 1.632s [INFO] Finished at: Sat Sep 28 13:24:55 CEST 2013 [INFO] Final Memory: 23M/981M Skip to content Ignore Learn more Please note that GitHub no longer supports old versions of Firefox.

When I try to package this project, I am getting the following error:[ERROR] Failed to execute goal org.apache.maven.plugins:maven-assembly-plugin:2.5:single (make-assembly) on project child-a: Failed to create assembly: Error adding file 'a.group.id:dep-a:jar:0.0.1-SNAPSHOT' to A better way to do this might be to use the maven-shade-plugin instead of doing this manually. before the clover:setup) is trying to access resources from dependent modules, which have been already instrumented by Clover (i.e. Is "halfly" a word?

if you do mvn clean compile package assembly:single it will build successfully. more hot questions question feed default about us tour help blog chat data legal privacy policy work here advertising info mobile contact us feedback Technology Life / Arts Culture / Recreation at org.apache.maven.plugin.assembly.archive.task.AddArtifactTask.execute(AddArtifactTask.java:193) at org.apache.maven.plugin.assembly.archive.task.AddDependencySetsTask.addDependencySet(AddDependencySetsTask.java:177) at org.apache.maven.plugin.assembly.archive.task.AddDependencySetsTask.execute(AddDependencySetsTask.java:116) at org.apache.maven.plugin.assembly.archive.phase.DependencySetAssemblyPhase.execute(DependencySetAssemblyPhase.java:74) at org.apache.maven.plugin.assembly.archive.DefaultAssemblyArchiver.createArchive(DefaultAssemblyArchiver.java:129) at org.apache.maven.plugin.assembly.mojos.AbstractAssemblyMojo.execute(AbstractAssemblyMojo.java:322) ... 18 more Caused by: org.codehaus.plexus.archiver.ArchiverException: /home/ckutz/procurement/eclipse_ws/argo-procurement/procurement-common/target/classes isn't a file. at org.apache.maven.plugin.assembly.mojos.AbstractAssemblyMojo.execute(AbstractAssemblyMojo.java:368) at org.apache.maven.plugin.DefaultPluginManager.executeMojo(DefaultPluginManager.java:451) at org.apache.maven.lifecycle.DefaultLifecycleExecutor.executeGoals(DefaultLifecycleExecutor.java:558) ... 16 more Caused by: org.apache.maven.plugin.assembly.archive.ArchiveCreationException: Error adding file 'net.tipp24.argo.procurement:procurement-common:jar:0.1.0-SNAPSHOT' to archive: /home/ckutz/procurement/eclipse_ws/argo-procurement/procurement-common/target/classes isn't a file.

Good Term For "Mild" Error (Software) Is it possible to have a planet unsuitable for agriculture? at org.apache.maven.lifecycle.DefaultLifecycleExecutor.executeGoals(DefaultLifecycleExecutor.java:583) at org.apache.maven.lifecycle.DefaultLifecycleExecutor.executeGoalWithLifecycle(DefaultLifecycleExecutor.java:499) at org.apache.maven.lifecycle.DefaultLifecycleExecutor.executeGoal(DefaultLifecycleExecutor.java:478) at org.apache.maven.lifecycle.DefaultLifecycleExecutor.executeGoalAndHandleFailures(DefaultLifecycleExecutor.java:330) at org.apache.maven.lifecycle.DefaultLifecycleExecutor.executeTaskSegments(DefaultLifecycleExecutor.java:291) at org.apache.maven.lifecycle.DefaultLifecycleExecutor.execute(DefaultLifecycleExecutor.java:142) at org.apache.maven.DefaultMaven.doExecute(DefaultMaven.java:336) at org.apache.maven.DefaultMaven.execute(DefaultMaven.java:129) at org.apache.maven.cli.MavenCli.main(MavenCli.java:287) at sun.reflect.NativeMethodAccessorImpl.invoke0(Native Method) at sun.reflect.NativeMethodAccessorImpl.invoke(NativeMethodAccessorImpl.java:39) at sun.reflect.DelegatingMethodAccessorImpl.invoke(DelegatingMethodAccessorImpl.java:25) at java.lang.reflect.Method.invoke(Method.java:597) at org.codehaus.classworlds.Launcher.launchEnhanced(Launcher.java:315) at org.codehaus.classworlds.Launcher.launch(Launcher.java:255) First, can you confirm that the problem occurs when you run maven build using one of Run As->Maven... ? What kind of bicycle clamps are these?

parent POM file 1 2 3 4 5 6 7 8 9 10 11 12 13 14 15 16 17 18 19 20 21 22 23 24 25 26 27 28 Does anyone have faced this issue?, is there a known workaround?Thanks a lot,Carlos Alegria Follow-Ups: Re: [m2e-users] problem with assembly on a multimodule project with interdependencies From: Igor Fedorenko Prev by Cause A problem is related with BAM-13208 - Improve Automatic Clover integration for multi-module maven builds Resolved . I suspect it's related to the increased number (now 4) of executors.

What's the most recent specific historical element that is common between Star Trek and the real world? Caused by: org.apache.maven.plugin.MojoExecutionException: Failed to create assembly: Error creating assembly archive withdep: Problem creating jar: jar:file:/opt/bamboo-agent-home/xml-data/build-dir/PROJ-PLAN-JOB/target/xyz-1.0.0-SNAPSHOT.jar!/instrumentation.ser at org.apache.maven.plugin.assembly.mojos.AbstractAssemblyMojo.execute(AbstractAssemblyMojo.java:495) ... more stack exchange communities company blog Stack Exchange Inbox Reputation and Badges sign up log in tour help Tour Start here for a quick overview of the site Help Center Detailed Full console: [magnolia-module-commenting#670/|http://hudson.magnolia-cms.com/view/X/job/magnolia-module-commenting/670/console] Grégory Joseph made changes - 25/Jul/13 2:03 PM Workflow Product Dev Workflow [ 33871 ] Product Dev Workflow without Selected [ 75685 ] Grégory Joseph made changes -

Join them; it only takes a minute: Sign up maven-assembly-plugin MojoExecutionException with dependencySet as outputDirectory up vote 8 down vote favorite 1 In my Khatami project I'm using maven to both See http://jira.codehaus.org/browse/MNGECLIPSE-1201 Show Christoph Kutzinski added a comment - 03/Mar/09 02:15 The maintainers of m2eclipse say that this is related to the workspace resolution feature and that I could be easier it is expecting a file and it can't find it because the package goal isn't running after the clean . It´s usually a good practice to fix such code smells.

regards, Eugene Scara Maccai wrote: > I'm having trouble invoking assembly:assembly using the plugin: > > The following mojo encountered an error while executing: > Group-Id: org.apache.maven.plugins > Artifact-Id: maven-assembly-plugin > The Build Smells Let us dive into the build and see if we find some kind of Build Smells. Hide Permalink Daniel Lipp added a comment - 09/Mar/12 8:24 AM Another example: standard-templating-kit-bundle#4720 Show Daniel Lipp added a comment - 09/Mar/12 8:24 AM Another example: standard-templating-kit-bundle#4720 Daniel Lipp made changes Results : Tests run: 2, Failures: 0, Errors: 0, Skipped: 0 [INFO] [INFO] --- maven-jar-plugin:2.4:jar (default-jar) @ maventutorial1 --- [INFO] Building jar: /home/andrea/git/maven-java-console-application/mvntutorial1/target/maventutorial1-0.0.1-SNAPSHOT.jar [INFO] [INFO] --- maven-assembly-plugin:2.5.5:single (default-cli) @ maventutorial1 ---

RSS Blog Archives Impressum Maven Best Practice Maven Plugin Releases Programming Build Smells - Maven Assembly Plugin Sep 28th, 2013 | Comments If you are a software developer (for example in We recommend upgrading to the latest Safari, Google Chrome, or Firefox. Browse other questions tagged java maven maven-assembly-plugin or ask your own question. Free forum by Nabble Edit this page SoftwareEntwicklung Beratung Schulung A coders, hackers heaven.....Hm...I do not think so...

Here is what a minimal settings file looks like with the repositories added: default true maven2-repository.dev.java.net http://download.java.net/maven/2 true true Caused by: org.apache.maven.plugin.PluginExecutionException: Execution make-assembly of goal org.apache.maven.plugins:maven-assembly-plugin:2.3:single failed. But sometimes if I take a deeper look into a Maven build I can observe things like Build Smells which could produce problems in future but not need to. java maven maven-3 maven-plugin maven-assembly-plugin share|improve this question asked Jul 20 '15 at 13:24 AndreaNobili 7,5932384163 add a comment| 2 Answers 2 active oldest votes up vote 3 down vote accepted

Is intelligence the "natural" product of evolution? In case when your original goals are: mvn clean they should be changed to: mvn clean clover:setup clover:aggregate clover:clover Notes The NullPointerException thrown Posted by Karl-Heinz Marbaise Sep 28th, 2013 Maven, Maven Best Practice, Maven-Plugins, News Tweet « Apache Maven Deploy Plugin - Release 2.8 Maven 3.1.1 Released » Comments Please enable JavaScript to It massively impairs the work with m2eclipse for me.

This will create the jar with dependencies in the target directory. Ok. Due to a fact that: Maven performs build module-by-module and not phase-by-phase (for example: if a project has module A and module B and you run 'mvn clean package' then Maven Game of Life, a shorter story Is the mass of an individual star almost constant throughout its life?

current community chat Stack Overflow Meta Stack Overflow your communities Sign up or log in to customize your list. Can a Legendary monster ignore a diviner's Portent and choose to pass the save anyway? It doesn't work even setting the external maven installation as the default, plus I'm using 2.1 from the command line too. Caused by: org.apache.maven.plugin.assembly.archive.ArchiveCreationException: Error creating assembly archive withdep: Problem creating jar: jar:file:/opt/bamboo-agent-home/xml-data/build-dir/PROJ-PLAN-JOB/target/xyz-1.0.0-SNAPSHOT.jar!/instrumentation.ser at org.apache.maven.plugin.assembly.archive.DefaultAssemblyArchiver.createArchive(DefaultAssemblyArchiver.java:190) ...

In this tutorial I have the following pom.xml configuration file: 4.0.0 com.denofprogramming maventutorial1 0.0.1-SNAPSHOT jar MavenTutorial1 http://maven.apache.org UTF-8 org.apache.maven.plugins maven-compiler-plugin 3.1 at org.apache.maven.lifecycle.internal.MojoExecutor.execute(MojoExecutor.java:216) at org.apache.maven.lifecycle.internal.MojoExecutor.execute(MojoExecutor.java:153) at org.apache.maven.lifecycle.internal.MojoExecutor.execute(MojoExecutor.java:145) at org.apache.maven.lifecycle.internal.LifecycleModuleBuilder.buildProject(LifecycleModuleBuilder.java:108) at org.apache.maven.lifecycle.internal.LifecycleModuleBuilder.buildProject(LifecycleModuleBuilder.java:76) at org.apache.maven.lifecycle.internal.builder.singlethreaded.SingleThreadedBuilder.build(SingleThreadedBuilder.java:51) at org.apache.maven.lifecycle.internal.LifecycleStarter.execute(LifecycleStarter.java:116) at org.apache.maven.DefaultMaven.doExecute(DefaultMaven.java:361) at org.apache.maven.DefaultMaven.execute(DefaultMaven.java:155) at org.apache.maven.cli.MavenCli.execute(MavenCli.java:584) at org.apache.maven.cli.MavenCli.doMain(MavenCli.java:213) at org.apache.maven.cli.MavenCli.main(MavenCli.java:157) at sun.reflect.NativeMethodAccessorImpl.invoke0(Native Method) at sun.reflect.NativeMethodAccessorImpl.invoke(NativeMethodAccessorImpl.java:57) at sun.reflect.DelegatingMethodAccessorImpl.invoke(DelegatingMethodAccessorImpl.java:43)