gdft.lo error 1 Washington Depot Connecticut

Address 425 Federal Rd, Brookfield, CT 06804
Phone (203) 740-0816
Website Link
Hours

gdft.lo error 1 Washington Depot, Connecticut

Anyway: CentOS 3.5 Part of the problem was I had no idea I was either missing the gd-2.0.33 libraries or they were corrupt or something. yeschecking for errno.h... yes If configure fails try --with-xpm-dir=

checking for fabsf... no checking for the location of libz...

You signed in with another tab or window. Closes #813. 8066891 joshua-rutherford pushed a commit to joshua-rutherford/homebrew that referenced this issue Dec 15, 2015 DomT4

Anyway: CentOS 3.5 Part of the problem was I had no idea I was either missing the gd-2.0.33 libraries or they were corrupt or something. yeschecking stddef.h presence... PTHREADCREATEJOINABLEchecking if more special flags are required for pthreads... Might be a problem with too eager ./configure script not with homebrew.

Extension path /home/andy/.phpbrew/build/php-5.6.6/ext/gd Log stored at: /home/andy/.phpbrew/build/php-5.6.6/ext/gd/build.log Changing directory to /home/andy/.phpbrew/build/php-5.6.6/ext/gd ===> Make clean Running Command:make -C /home/andy/.phpbrew/build/php-5.6.6/ext/gd --quiet clean ===> Phpize... yes checking for /usr/bin/ld option to reload object files... -r checking for BSD-compatible nm... /usr/bin/nm -B checking whether ln -s works... yeschecking for jpegsetdefaults in -ljpeg... We recommend upgrading to the latest Safari, Google Chrome, or Firefox.

All I got was the tables and data but the graphics had the white square with the red X on them. Install the gd libraries: Code: cd /root wget http://www.boutell.com/gd/http/gd-2.0.33.tar.gz cd gd-2.0.33 ./configure make make install Then install GD: Code: wget http://cpan.mirror.solnet.ch/modules/by-module/GD/GD-2.30.tar.gz zcat GD-2.30.tar.gz | tar xvf - cd GD-2.30 perl Makefile.PL Could someone verify this? All I got was the tables and data but the graphics had the white square with the red X on them.

no checking dynamic linker characteristics... Yes, my password is: Forgot your password? No, create an account now. yes checking for sys/stat.h...

Contact GitHub API Training Shop Blog About © 2016 GitHub, Inc. nochecking dynamic linker characteristics... gdft.c:111:10: #include expects "FILENAME" or make[2]: *** [gdft.lo] Error 1 make[2]: Leaving directory `/usr/local/src/gd-2.0.33' make[1]: *** [all-recursive] Error 1 make[1]: Leaving directory `/usr/local/src/gd-2.0.33' make: *** [all] Error 2 Even manually Apple may provide or recommend responses as a possible solution based on the information provided; every potential issue may involve several factors not detailed in the conversations captured in an electronic

strip checking if cc supports -fno-rtti -fno-exceptions... I did not see GD errors when i recompiled the box twice last night and installed phpsuexec. checking for suffix of object files... yeschecking for iconv.h...

gccchecking for C compiler default output file name... Newer Than: Search this thread only Search this forum only Display results as threads More... Signed-off-by: Dominyk Tiller ">openjpeg21: bottle … Closes #813. Very frustating.

no checking for the location of libpng... yes checking how to recognize dependent libraries... Skip to content Ignore Learn more Please note that GitHub no longer supports old versions of Firefox. Home | New | Search | [?] | Reports | Requests | Help | NewAccount | Log In [x] | Forgot Password Login: [x] | Report Bugzilla Bug Legal

libraries /usr/X11/lib, headers /usr/X11/includechecking for ANSI C header files... (cached) yeschecking errno.h usability... Thanks, -Stinky #6 stinky, Oct 23, 2005 jackie46 BANNED Joined: Jul 25, 2005 Messages: 537 Likes Received: 0 Trophy Points: 0 stinky said: This did not work for me. yeschecking for memory.h... tamasnagy commented Feb 23, 2010 It gives the same error with pkg-config installed.

no checking for cc option to produce PIC... -fPIC checking if cc PIC flag -fPIC works... yeschecking for inttypes.h... Just a minute ago it finally worked. yes checking for sys/types.h...

I did not know that. yes checking for strings.h... a.outchecking whether the C compiler works... You signed out in another tab or window.

Thanks all who have contributed up to this point and please let me know if there is a potential problem with what I've just done. I see these errors only during upcp and susup. Although in that case it is png.h which is missing. no checking if compiler supports -Wl,-rpath,...

yesrm: conftest.dSYM: is a directorychecking for sin... yes checking for system library directory... gd is different from GD! yeschecking for freetype-config... $INSTALL_DIR/bin/freetype-configchecking for FTInitFreeType in -lfreetype...

none needed checking how to run the C preprocessor...